{"text_format":"1","workbook":"xlsx","n_sheets":13,"sheets":["Verbraucher_Consommateurs","Anlage_Installation","Wärmezentrale_CentraleThermique","Bilder_DE","Figures_FR","Bilder_IT","Text","Hilfsblatt","Klimadaten","AT-Vergleichsdaten","Q-Plan Tabelle_QM Tableau","AT-Vergleich_Comparaison TE","Aenderungsprotokoll"],"not_rendered":{"charts":21,"images":5,"macros":1,"external_links":0,"defined_names":9,"comments":0,"pivot_tables":0},"unopened":[],"bounds":{"document_bytes":16777216,"sheet_cells":100000,"rows_first":2000,"rows_last":500,"rows_between":2000,"halvings":0,"cell_chars":16384,"cell_head_chars":4096},"cells_cut":0,"cells_raw":0,"read":"whole","date_system":"1900"}

{"sheet":"Verbraucher_Consommateurs","index":0,"n_rows":50,"n_cols":256,"rows_kept":50,"cut":false,"hidden":false,"merged":[]}
[{"$f":"Text!C2","v":"QM Holzheizwerke"}]
[]
[{"$f":"Text!C3","v":"Projekt/Variante:"},{"$f":"Text!C5","v":"Musterbeispiel (Linie 1)"}]
[null,{"$f":"Text!C6","v":"Musterbeispiel (Linie 2)"}]
[null,{"$f":"Text!C7","v":"Musterbeispiel (Linie 3)"}]
[{"$f":"Text!C4","v":"Erfasst von:"},{"$f":"Text!C8","v":"Musterplaner"}]
[{"$f":"Text!C14","v":"Datum:"},"2014-05-02"]
[]
[{"$f":"Text!C9","v":"Eingaben Hauptplaner"}]
[]
[{"$f":"Text!C10","v":"Allgemeines"},{"$f":"Text!C11","v":"Nummer"},1,{"$f":"IF(AND(ISBLANK(C19)=TRUE,ISBLANK(C20)=TRUE,ISBLANK(C23)=TRUE,ISBLANK(C24)=TRUE,ISBLANK(C25)=TRUE,ISBLANK(C26)=TRUE),\"\",C11+1)","v":2},{"$f":"IF(AND(ISBLANK(D19)=TRUE,ISBLANK(D20)=TRUE,ISBLANK(D23)=TRUE,ISBLANK(D24)=TRUE,ISBLANK(D25)=TRUE,ISBLANK(D26)=TRUE),\"\",D11+1)","v":3},4,5,"","","","","","","","","","","","","","","","","","","","","","","","","","","","","","","","","","","","","","","","","","","","","","","","","","","","","","","","","","","","","",{"$f":"IF(AND(ISBLANK(BP19)=TRUE,ISBLANK(BP20)=TRUE,ISBLANK(BP23)=TRUE,ISBLANK(BP24)=TRUE,ISBLANK(BP25)=TRUE,ISBLANK(BP26)=TRUE),\"\",BP11+1)","v":""},"","","","","","","","","","","","","","","","","","","","","","","","","","","","","","","","","","","","","","","","","","","","","","","","","","","","","","","","","","","","","","","",{"$f":"IF(AND(ISBLANK(EB19)=TRUE,ISBLANK(EB20)=TRUE,ISBLANK(EB23)=TRUE,ISBLANK(EB24)=TRUE,ISBLANK(EB25)=TRUE,ISBLANK(EB26)=TRUE),\"\",EB11+1)","v":""},"","","","","","","","","","","","","","","","","","","","","","","","","","","","","","","","","","","","","","","","","","","","","","","","","","","","","","","","","","","","","","","",{"$f":"IF(AND(ISBLANK(GN19)=TRUE,ISBLANK(GN20)=TRUE,ISBLANK(GN23)=TRUE,ISBLANK(GN24)=TRUE,ISBLANK(GN25)=TRUE,ISBLANK(GN26)=TRUE),\"\",GN11+1)","v":""},"","","","","","","","","","","","","","","","","","","","","","","","","","","","","","","","","","","","","","","","","","","","","","","","","","","","","","","","","","",""]
[null,{"$f":"Text!C12","v":"Bezeichnung"},{"$f":"Text!C105","v":"Sanierung"},{"$f":"Text!C110","v":"Altes"},{"$f":"Text!C115","v":"Prozess"},{"$f":"Text!C107","v":"Neubau"}]
[null,null,null,{"$f":"Text!C111","v":"Schulhaus"},{"$f":"Text!C116","v":" "}]
[null,null,null,{"$f":"Text!C112","v":"Musterstrasse"},{"$f":"Text!C117","v":" "}]
[null,{"$f":"Text!C15","v":"Wärmebedarfsermittlung anhand"},{"$f":"Text!C106","v":"Öl-Lieferung"},{"$f":"Text!C113","v":"Abrechnung"},{"$f":"Text!C118","v":"Messung"},{"$f":"Text!C108","v":"SIA-Norm"}]
[null,{"$f":"Text!C16","v":"Energiebezugsfläche [m²]"},20000,10000,null,400]
[null,{"$f":"Text!C17","v":"Max. Vorlauftemperatur [°C]"},80,80,80,80]
[null,{"$f":"Text!C18","v":"Max. Rücklauftemperatur [°C]"},50,55,60,60]
[{"$f":"Text!C19","v":"Raumwärme"},{"$f":"Text!C20","v":"Heizwärmebedarf [MWh/a]"},2000,780,null,12]
[null,{"$f":"Text!C21","v":"Max. Wärmeleistungsbedarf Raumwärme [kW]"},850,450,null,10]
[null,{"$f":"Text!C22","v":"Korrekturfaktor Heizwärmebedarf [-]"},1,0.85,null,0.7]
[null,{"$f":"Text!C23","v":"Korrekturfaktor Aufheizspitze [-]"},1,1,null,1]
[{"$f":"Text!C24","v":"Warmwasser"},{"$f":"Text!C25","v":"Jahreswärmebedarf Warmwasser [MWh/a]*"},560,70,null,11]
[null,{"$f":"Text!C26","v":"Max. Wärmeleistungsbedarf Warmwasser [kW]"},130,20,null,2.5]
[{"$f":"Text!C27","v":"Prozesswärme"},{"$f":"Text!C28","v":"Jahreswärmebedarf Prozesswärme [MWh/a]*"},null,null,500]
[null,{"$f":"Text!C29","v":"Max. Wärmeleistungsbedarf Prozesswärme [kW]"},null,null,100]
[]
[]
[{"$f":"Text!C31","v":"Berechnete Kennzahlen"}]
[]
[{"$f":"Text!C81","v":"Gesamt-Wärmebedarf [MWh/a]"},null,{"$f":"C19+C23+C25","v":2560},{"$f":"D19+D23+D25","v":850},500,23,0,0,0,0,0,0,0,0,0,0,0,0,0,0,0,0,0,0,0,0,0,0,0,0,0,0,0,0,0,0,0,0,0,0,0,0,0,0,0,0,0,0,0,0,0,0,0,0,0,0,0,0,0,0,0,0,0,0,0,0,0,{"$f":"BP19+BP23+BP25","v":0},0,0,0,0,0,0,0,0,0,0,0,0,0,0,0,0,0,0,0,0,0,0,0,0,0,0,0,0,0,0,0,0,0,0,0,0,0,0,0,0,0,0,0,0,0,0,0,0,0,0,0,0,0,0,0,0,0,0,0,0,0,0,0,{"$f":"EB19+EB23+EB25","v":0},0,0,0,0,0,0,0,0,0,0,0,0,0,0,0,0,0,0,0,0,0,0,0,0,0,0,0,0,0,0,0,0,0,0,0,0,0,0,0,0,0,0,0,0,0,0,0,0,0,0,0,0,0,0,0,0,0,0,0,0,0,0,0,{"$f":"GN19+GN23+GN25","v":0},0,0,0,0,0,0,0,0,0,0,0,0,0,0,0,0,0,0,0,0,0,0,0,0,0,0,0,0,0,0,0,0,0,0,0,0,0,0,0,0,0,0,0,0,0,0,0,0,0,0,0,0,0,0,0,0,0,0,0,0]
[{"$f":"Text!C32","v":"Raumwärme"},{"$f":"Text!C33","v":"Vollbetriebsstundenzahl Raumwärme [h/a]"},{"$f":"IF(C20=\"\",\"\",ROUND(C19*1000/C20,2))","v":2352.94},1733.33,"",1200,"","","","","","","","","","","","","","","","","","","","","","","","","","","","","","","","","","","","","","","","","","","","","","","","","","","","","","","","","","","","",{"$f":"IF(BO20=\"\",\"\",ROUND(BO19*1000/BO20,2))","v":""},"","","","","","","","","","","","","","","","","","","","","","","","","","","","","","","","","","","","","","","","","","","","","","","","","","","","","","","","","","","","","","","",{"$f":"IF(EA20=\"\",\"\",ROUND(EA19*1000/EA20,2))","v":""},"","","","","","","","","","","","","","","","","","","","","","","","","","","","","","","","","","","","","","","","","","","","","","","","","","","","","","","","","","","","","","","",{"$f":"IF(GM20=\"\",\"\",ROUND(GM19*1000/GM20,2))","v":""},"","","","","","","","","","","","","","","","","","","","","","","","","","","","","","","","","","","","","","","","","","","","","","","","","","","","","","","","","","","","",""]
[null,{"$f":"Text!C34","v":"Spezifischer Heizwärmebedarf [kWh/m²a]"},{"$f":"IF(C16=\"\",\"\",ROUND(C19*1000/C16,3))","v":100},{"$f":"IF(D16=\"\",\"\",ROUND(D19*1000/D16,3))","v":78},{"$f":"IF(E16=\"\",\"\",ROUND(E19*1000/E16,3))","v":""},30,"","","","","","","","","","","","","","","","","","","","","","","","","","","","","","","","","","","","","","","","","","","","","","","","","","","","","","","","","","","","","","",{"$f":"IF(BQ16=\"\",\"\",ROUND(BQ19*1000/BQ16,3))","v":""},"","","","","","","","","","","","","","","","","","","","","","","","","","","","","","","","","","","","","","","","","","","","","","","","","","","","","","","","","","","","","","","",{"$f":"IF(EC16=\"\",\"\",ROUND(EC19*1000/EC16,3))","v":""},"","","","","","","","","","","","","","","","","","","","","","","","","","","","","","","","","","","","","","","","","","","","","","","","","","","","","","","","","","","","","","","",{"$f":"IF(GO16=\"\",\"\",ROUND(GO19*1000/GO16,3))","v":""},"","","","","","","","","","","","","","","","","","","","","","","","","","","","","","","","","","","","","","","","","","","","","","","","","","","","","","","","","","",""]
[null,{"$f":"Text!C35","v":"Spezifischer Wärmeleistungsbedarf [W/m²]"},{"$f":"IF(C16=\"\",\"\",ROUND(C20*1000/C16,3))","v":42.5},{"$f":"IF(D16=\"\",\"\",ROUND(D20*1000/D16,3))","v":45},{"$f":"IF(E16=\"\",\"\",ROUND(E20*1000/E16,3))","v":""},25,"","","","","","","","","","","","","","","","","","","","","","","","","","","","","","","","","","","","","","","","","","","","","","","","","","","","","","","","","","","","","","",{"$f":"IF(BQ16=\"\",\"\",ROUND(BQ20*1000/BQ16,3))","v":""},"","","","","","","","","","","","","","","","","","","","","","","","","","","","","","","","","","","","","","","","","","","","","","","","","","","","","","","","","","","","","","","",{"$f":"IF(EC16=\"\",\"\",ROUND(EC20*1000/EC16,3))","v":""},"","","","","","","","","","","","","","","","","","","","","","","","","","","","","","","","","","","","","","","","","","","","","","","","","","","","","","","","","","","","","","","",{"$f":"IF(GO16=\"\",\"\",ROUND(GO20*1000/GO16,3))","v":""},"","","","","","","","","","","","","","","","","","","","","","","","","","","","","","","","","","","","","","","","","","","","","","","","","","","","","","","","","","",""]
[{"$f":"Text!C36","v":"Warmwasser"},{"$f":"Text!C37","v":"Vollbetriebsstundenzahl Warmwasser [h/a]"},{"$f":"IF(C24=\"\",\"\",ROUND(C23*1000/C24,2))","v":4307.6899999999996},{"$f":"IF(D24=\"\",\"\",ROUND(D23*1000/D24,2))","v":3500},"",4400,"","","","","","","","","","","","","","","","","","","","","","","","","","","","","","","","","","","","","","","","","","","","","","","","","","","","","","","","","","","","","",{"$f":"IF(BP24=\"\",\"\",ROUND(BP23*1000/BP24,2))","v":""},"","","","","","","","","","","","","","","","","","","","","","","","","","","","","","","","","","","","","","","","","","","","","","","","","","","","","","","","","","","","","","","",{"$f":"IF(EB24=\"\",\"\",ROUND(EB23*1000/EB24,2))","v":""},"","","","","","","","","","","","","","","","","","","","","","","","","","","","","","","","","","","","","","","","","","","","","","","","","","","","","","","","","","","","","","","",{"$f":"IF(GN24=\"\",\"\",ROUND(GN23*1000/GN24,2))","v":""},"","","","","","","","","","","","","","","","","","","","","","","","","","","","","","","","","","","","","","","","","","","","","","","","","","","","","","","","","","","",""]
[null,{"$f":"Text!C38","v":"Spezifischer Energiebedarf Warmwasser [kWh/m²a]"},{"$f":"IF(C16=\"\",\"\",ROUND(C23*1000/C16,3))","v":28},{"$f":"IF(D16=\"\",\"\",ROUND(D23*1000/D16,3))","v":7},"",27.5,"","","","","","","","","","","","","","","","","","","","","","","","","","","","","","","","","","","","","","","","","","","","","","","","","","","","","","","","","","","","","",{"$f":"IF(BP16=\"\",\"\",ROUND(BP23*1000/BP16,3))","v":""},"","","","","","","","","","","","","","","","","","","","","","","","","","","","","","","","","","","","","","","","","","","","","","","","","","","","","","","","","","","","","","","",{"$f":"IF(EB16=\"\",\"\",ROUND(EB23*1000/EB16,3))","v":""},"","","","","","","","","","","","","","","","","","","","","","","","","","","","","","","","","","","","","","","","","","","","","","","","","","","","","","","","","","","","","","","",{"$f":"IF(GN16=\"\",\"\",ROUND(GN23*1000/GN16,3))","v":""},"","","","","","","","","","","","","","","","","","","","","","","","","","","","","","","","","","","","","","","","","","","","","","","","","","","","","","","","","","","",""]
[{"$f":"Text!C39","v":"Prozesswärme"},{"$f":"Text!C40","v":"Vollbetriebsstundenzahl Prozesswärme [h/a]"},{"$f":"IF(C26=\"\",\"\",ROUND(C25*1000/C26,2))","v":""},{"$f":"IF(D26=\"\",\"\",ROUND(D25*1000/D26,2))","v":""},5000,"","","","","","","","","","","","","","","","","","","","","","","","","","","","","","","","","","","","","","","","","","","","","","","","","","","","","","","","","","","","","","",{"$f":"IF(BP26=\"\",\"\",ROUND(BP25*1000/BP26,2))","v":""},"","","","","","","","","","","","","","","","","","","","","","","","","","","","","","","","","","","","","","","","","","","","","","","","","","","","","","","","","","","","","","","",{"$f":"IF(EB26=\"\",\"\",ROUND(EB25*1000/EB26,2))","v":""},"","","","","","","","","","","","","","","","","","","","","","","","","","","","","","","","","","","","","","","","","","","","","","","","","","","","","","","","","","","","","","","",{"$f":"IF(GN26=\"\",\"\",ROUND(GN25*1000/GN26,2))","v":""},"","","","","","","","","","","","","","","","","","","","","","","","","","","","","","","","","","","","","","","","","","","","","","","","","","","","","","","","","","","",""]
[]
[{"$f":"Text!C42","v":"* Es ist der Jahreswärmebedarf für 365 Tage einzugeben "}]
[{"$f":"Text!C43","v":"(Winter-Wärmebedarf = Jahreswärmebedarf x Heiztage / 365 Tage)"}]
[null,{"$f":"B42","v":"Situationserfassung V35"}]
[{"$f":"Text!C45","v":"Eingabefelder"},"Situationserfassung V35"]
[null,{"$f":"Text!C30","v":"Empfohlene Dateiformate: .xlsm oder .xls (Excel 97-2004)"}]
[]
[{"$f":"Text!C13","v":"Sprache:"}]
[]
[]
["Hilfswerte",null,{"$f":"IF(C18=\"\",\"\",ROUND((C20+C24+C26)/(Anlage_Installation!$C$15-Verbraucher_Consommateurs!C18),3))","v":28},{"$f":"IF(D18=\"\",\"\",ROUND((D20+D24+D26)/(Anlage_Installation!$C$15-Verbraucher_Consommateurs!D18),3))","v":15.667},{"$f":"IF(E18=\"\",\"\",ROUND((E20+E24+E26)/(Anlage_Installation!$C$15-Verbraucher_Consommateurs!E18),3))","v":4},{"$f":"IF(F18=\"\",\"\",ROUND((F20+F24+F26)/(Anlage_Installation!$C$15-Verbraucher_Consommateurs!F18),3))","v":0.5},{"$f":"IF(G18=\"\",\"\",ROUND((G20+G24+G26)/(Anlage_Installation!$C$15-Verbraucher_Consommateurs!G18),3))","v":""},{"$f":"IF(H18=\"\",\"\",ROUND((H20+H24+H26)/(Anlage_Installation!$C$15-Verbraucher_Consommateurs!H18),3))","v":""},{"$f":"IF(I18=\"\",\"\",ROUND((I20+I24+I26)/(Anlage_Installation!$C$15-Verbraucher_Consommateurs!I18),3))","v":""},{"$f":"IF(J18=\"\",\"\",ROUND((J20+J24+J26)/(Anlage_Installation!$C$15-Verbraucher_Consommateurs!J18),3))","v":""},{"$f":"IF(K18=\"\",\"\",ROUND((K20+K24+K26)/(Anlage_Installation!$C$15-Verbraucher_Consommateurs!K18),3))","v":""},{"$f":"IF(L18=\"\",\"\",ROUND((L20+L24+L26)/(Anlage_Installation!$C$15-Verbraucher_Consommateurs!L18),3))","v":""},{"$f":"IF(M18=\"\",\"\",ROUND((M20+M24+M26)/(Anlage_Installation!$C$15-Verbraucher_Consommateurs!M18),3))","v":""},{"$f":"IF(N18=\"\",\"\",ROUND((N20+N24+N26)/(Anlage_Installation!$C$15-Verbraucher_Consommateurs!N18),3))","v":""},{"$f":"IF(O18=\"\",\"\",ROUND((O20+O24+O26)/(Anlage_Installation!$C$15-Verbraucher_Consommateurs!O18),3))","v":""},{"$f":"IF(P18=\"\",\"\",ROUND((P20+P24+P26)/(Anlage_Installation!$C$15-Verbraucher_Consommateurs!P18),3))","v":""},{"$f":"IF(Q18=\"\",\"\",ROUND((Q20+Q24+Q26)/(Anlage_Installation!$C$15-Verbraucher_Consommateurs!Q18),3))","v":""},{"$f":"IF(R18=\"\",\"\",ROUND((R20+R24+R26)/(Anlage_Installation!$C$15-Verbraucher_Consommateurs!R18),3))","v":""},{"$f":"IF(S18=\"\",\"\",ROUND((S20+S24+S26)/(Anlage_Installation!$C$15-Verbraucher_Consommateurs!S18),3))","v":""},{"$f":"IF(T18=\"\",\"\",ROUND((T20+T24+T26)/(Anlage_Installation!$C$15-Verbraucher_Consommateurs!T18),3))","v":""},{"$f":"IF(U18=\"\",\"\",ROUND((U20+U24+U26)/(Anlage_Installation!$C$15-Verbraucher_Consommateurs!U18),3))","v":""},{"$f":"IF(V18=\"\",\"\",ROUND((V20+V24+V26)/(Anlage_Installation!$C$15-Verbraucher_Consommateurs!V18),3))","v":""},{"$f":"IF(W18=\"\",\"\",ROUND((W20+W24+W26)/(Anlage_Installation!$C$15-Verbraucher_Consommateurs!W18),3))","v":""},{"$f":"IF(X18=\"\",\"\",ROUND((X20+X24+X26)/(Anlage_Installation!$C$15-Verbraucher_Consommateurs!X18),3))","v":""},{"$f":"IF(Y18=\"\",\"\",ROUND((Y20+Y24+Y26)/(Anlage_Installation!$C$15-Verbraucher_Consommateurs!Y18),3))","v":""},{"$f":"IF(Z18=\"\",\"\",ROUND((Z20+Z24+Z26)/(Anlage_Installation!$C$15-Verbraucher_Consommateurs!Z18),3))","v":""},{"$f":"IF(AA18=\"\",\"\",ROUND((AA20+AA24+AA26)/(Anlage_Installation!$C$15-Verbraucher_Consommateurs!AA18),3))","v":""},{"$f":"IF(AB18=\"\",\"\",ROUND((AB20+AB24+AB26)/(Anlage_Installation!$C$15-Verbraucher_Consommateurs!AB18),3))","v":""},{"$f":"IF(AC18=\"\",\"\",ROUND((AC20+AC24+AC26)/(Anlage_Installation!$C$15-Verbraucher_Consommateurs!AC18),3))","v":""},{"$f":"IF(AD18=\"\",\"\",ROUND((AD20+AD24+AD26)/(Anlage_Installation!$C$15-Verbraucher_Consommateurs!AD18),3))","v":""},{"$f":"IF(AE18=\"\",\"\",ROUND((AE20+AE24+AE26)/(Anlage_Installation!$C$15-Verbraucher_Consommateurs!AE18),3))","v":""},{"$f":"IF(AF18=\"\",\"\",ROUND((AF20+AF24+AF26)/(Anlage_Installation!$C$15-Verbraucher_Consommateurs!AF18),3))","v":""},{"$f":"IF(AG18=\"\",\"\",ROUND((AG20+AG24+AG26)/(Anlage_Installation!$C$15-Verbraucher_Consommateurs!AG18),3))","v":""},{"$f":"IF(AH18=\"\",\"\",ROUND((AH20+AH24+AH26)/(Anlage_Installation!$C$15-Verbraucher_Consommateurs!AH18),3))","v":""},{"$f":"IF(AI18=\"\",\"\",ROUND((AI20+AI24+AI26)/(Anlage_Installation!$C$15-Verbraucher_Consommateurs!AI18),3))","v":""},{"$f":"IF(AJ18=\"\",\"\",ROUND((AJ20+AJ24+AJ26)/(Anlage_Installation!$C$15-Verbraucher_Consommateurs!AJ18),3))","v":""},{"$f":"IF(AK18=\"\",\"\",ROUND((AK20+AK24+AK26)/(Anlage_Installation!$C$15-Verbraucher_Consommateurs!AK18),3))","v":""},{"$f":"IF(AL18=\"\",\"\",ROUND((AL20+AL24+AL26)/(Anlage_Installation!$C$15-Verbraucher_Consommateurs!AL18),3))","v":""},{"$f":"IF(AM18=\"\",\"\",ROUND((AM20+AM24+AM26)/(Anlage_Installation!$C$15-Verbraucher_Consommateurs!AM18),3))","v":""},{"$f":"IF(AN18=\"\",\"\",ROUND((AN20+AN24+AN26)/(Anlage_Installation!$C$15-Verbraucher_Consommateurs!AN18),3))","v":""},{"$f":"IF(AO18=\"\",\"\",ROUND((AO20+AO24+AO26)/(Anlage_Installation!$C$15-Verbraucher_Consommateurs!AO18),3))","v":""},{"$f":"IF(AP18=\"\",\"\",ROUND((AP20+AP24+AP26)/(Anlage_Installation!$C$15-Verbraucher_Consommateurs!AP18),3))","v":""},{"$f":"IF(AQ18=\"\",\"\",ROUND((AQ20+AQ24+AQ26)/(Anlage_Installation!$C$15-Verbraucher_Consommateurs!AQ18),3))","v":""},{"$f":"IF(AR18=\"\",\"\",ROUND((AR20+AR24+AR26)/(Anlage_Installation!$C$15-Verbraucher_Consommateurs!AR18),3))","v":""},{"$f":"IF(AS18=\"\",\"\",ROUND((AS20+AS24+AS26)/(Anlage_Installation!$C$15-Verbraucher_Consommateurs!AS18),3))","v":""},{"$f":"IF(AT18=\"\",\"\",ROUND((AT20+AT24+AT26)/(Anlage_Installation!$C$15-Verbraucher_Consommateurs!AT18),3))","v":""},{"$f":"IF(AU18=\"\",\"\",ROUND((AU20+AU24+AU26)/(Anlage_Installation!$C$15-Verbraucher_Consommateurs!AU18),3))","v":""},{"$f":"IF(AV18=\"\",\"\",ROUND((AV20+AV24+AV26)/(Anlage_Installation!$C$15-Verbraucher_Consommateurs!AV18),3))","v":""},{"$f":"IF(AW18=\"\",\"\",ROUND((AW20+AW24+AW26)/(Anlage_Installation!$C$15-Verbraucher_Consommateurs!AW18),3))","v":""},{"$f":"IF(AX18=\"\",\"\",ROUND((AX20+AX24+AX26)/(Anlage_Installation!$C$15-Verbraucher_Consommateurs!AX18),3))","v":""},{"$f":"IF(AY18=\"\",\"\",ROUND((AY20+AY24+AY26)/(Anlage_Installation!$C$15-Verbraucher_Consommateurs!AY18),3))","v":""},{"$f":"IF(AZ18=\"\",\"\",ROUND((AZ20+AZ24+AZ26)/(Anlage_Installation!$C$15-Verbraucher_Consommateurs!AZ18),3))","v":""},{"$f":"IF(BA18=\"\",\"\",ROUND((BA20+BA24+BA26)/(Anlage_Installation!$C$15-Verbraucher_Consommateurs!BA18),3))","v":""},{"$f":"IF(BB18=\"\",\"\",ROUND((BB20+BB24+BB26)/(Anlage_Installation!$C$15-Verbraucher_Consommateurs!BB18),3))","v":""},{"$f":"IF(BC18=\"\",\"\",ROUND((BC20+BC24+BC26)/(Anlage_Installation!$C$15-Verbraucher_Consommateurs!BC18),3))","v":""},{"$f":"IF(BD18=\"\",\"\",ROUND((BD20+BD24+BD26)/(Anlage_Installation!$C$15-Verbraucher_Consommateurs!BD18),3))","v":""},{"$f":"IF(BE18=\"\",\"\",ROUND((BE20+BE24+BE26)/(Anlage_Installation!$C$15-Verbraucher_Consommateurs!BE18),3))","v":""},{"$f":"IF(BF18=\"\",\"\",ROUND((BF20+BF24+BF26)/(Anlage_Installation!$C$15-Verbraucher_Consommateurs!BF18),3))","v":""},{"$f":"IF(BG18=\"\",\"\",ROUND((BG20+BG24+BG26)/(Anlage_Installation!$C$15-Verbraucher_Consommateurs!BG18),3))","v":""},{"$f":"IF(BH18=\"\",\"\",ROUND((BH20+BH24+BH26)/(Anlage_Installation!$C$15-Verbraucher_Consommateurs!BH18),3))","v":""},{"$f":"IF(BI18=\"\",\"\",ROUND((BI20+BI24+BI26)/(Anlage_Installation!$C$15-Verbraucher_Consommateurs!BI18),3))","v":""},{"$f":"IF(BJ18=\"\",\"\",ROUND((BJ20+BJ24+BJ26)/(Anlage_Installation!$C$15-Verbraucher_Consommateurs!BJ18),3))","v":""},{"$f":"IF(BK18=\"\",\"\",ROUND((BK20+BK24+BK26)/(Anlage_Installation!$C$15-Verbraucher_Consommateurs!BK18),3))","v":""},{"$f":"IF(BL18=\"\",\"\",ROUND((BL20+BL24+BL26)/(Anlage_Installation!$C$15-Verbraucher_Consommateurs!BL18),3))","v":""},{"$f":"IF(BM18=\"\",\"\",ROUND((BM20+BM24+BM26)/(Anlage_Installation!$C$15-Verbraucher_Consommateurs!BM18),3))","v":""},{"$f":"IF(BN18=\"\",\"\",ROUND((BN20+BN24+BN26)/(Anlage_Installation!$C$15-Verbraucher_Consommateurs!BN18),3))","v":""},{"$f":"IF(BO18=\"\",\"\",ROUND((BO20+BO24+BO26)/(Anlage_Installation!$C$15-Verbraucher_Consommateurs!BO18),3))","v":""},{"$f":"IF(BP18=\"\",\"\",ROUND((BP20+BP24+BP26)/(Anlage_Installation!$C$15-Verbraucher_Consommateurs!BP18),3))","v":""},{"$f":"IF(BQ18=\"\",\"\",ROUND((BQ20+BQ24+BQ26)/(Anlage_Installation!$C$15-Verbraucher_Consommateurs!BQ18),3))","v":""},{"$f":"IF(BR18=\"\",\"\",ROUND((BR20+BR24+BR26)/(Anlage_Installation!$C$15-Verbraucher_Consommateurs!BR18),3))","v":""},{"$f":"IF(BS18=\"\",\"\",ROUND((BS20+BS24+BS26)/(Anlage_Installation!$C$15-Verbraucher_Consommateurs!BS18),3))","v":""},{"$f":"IF(BT18=\"\",\"\",ROUND((BT20+BT24+BT26)/(Anlage_Installation!$C$15-Verbraucher_Consommateurs!BT18),3))","v":""},{"$f":"IF(BU18=\"\",\"\",ROUND((BU20+BU24+BU26)/(Anlage_Installation!$C$15-Verbraucher_Consommateurs!BU18),3))","v":""},{"$f":"IF(BV18=\"\",\"\",ROUND((BV20+BV24+BV26)/(Anlage_Installation!$C$15-Verbraucher_Consommateurs!BV18),3))","v":""},{"$f":"IF(BW18=\"\",\"\",ROUND((BW20+BW24+BW26)/(Anlage_Installation!$C$15-Verbraucher_Consommateurs!BW18),3))","v":""},{"$f":"IF(BX18=\"\",\"\",ROUND((BX20+BX24+BX26)/(Anlage_Installation!$C$15-Verbraucher_Consommateurs!BX18),3))","v":""},{"$f":"IF(BY18=\"\",\"\",ROUND((BY20+BY24+BY26)/(Anlage_Installation!$C$15-Verbraucher_Consommateurs!BY18),3))","v":""},{"$f":"IF(BZ18=\"\",\"\",ROUND((BZ20+BZ24+BZ26)/(Anlage_Installation!$C$15-Verbraucher_Consommateurs!BZ18),3))","v":""},{"$f":"IF(CA18=\"\",\"\",ROUND((CA20+CA24+CA26)/(Anlage_Installation!$C$15-Verbraucher_Consommateurs!CA18),3))","v":""},{"$f":"IF(CB18=\"\",\"\",ROUND((CB20+CB24+CB26)/(Anlage_Installation!$C$15-Verbraucher_Consommateurs!CB18),3))","v":""},{"$f":"IF(CC18=\"\",\"\",ROUND((CC20+CC24+CC26)/(Anlage_Installation!$C$15-Verbraucher_Consommateurs!CC18),3))","v":""},{"$f":"IF(CD18=\"\",\"\",ROUND((CD20+CD24+CD26)/(Anlage_Installation!$C$15-Verbraucher_Consommateurs!CD18),3))","v":""},{"$f":"IF(CE18=\"\",\"\",ROUND((CE20+CE24+CE26)/(Anlage_Installation!$C$15-Verbraucher_Consommateurs!CE18),3))","v":""},{"$f":"IF(CF18=\"\",\"\",ROUND((CF20+CF24+CF26)/(Anlage_Installation!$C$15-Verbraucher_Consommateurs!CF18),3))","v":""},{"$f":"IF(CG18=\"\",\"\",ROUND((CG20+CG24+CG26)/(Anlage_Installation!$C$15-Verbraucher_Consommateurs!CG18),3))","v":""},{"$f":"IF(CH18=\"\",\"\",ROUND((CH20+CH24+CH26)/(Anlage_Installation!$C$15-Verbraucher_Consommateurs!CH18),3))","v":""},{"$f":"IF(CI18=\"\",\"\",ROUND((CI20+CI24+CI26)/(Anlage_Installation!$C$15-Verbraucher_Consommateurs!CI18),3))","v":""},{"$f":"IF(CJ18=\"\",\"\",ROUND((CJ20+CJ24+CJ26)/(Anlage_Installation!$C$15-Verbraucher_Consommateurs!CJ18),3))","v":""},{"$f":"IF(CK18=\"\",\"\",ROUND((CK20+CK24+CK26)/(Anlage_Installation!$C$15-Verbraucher_Consommateurs!CK18),3))","v":""},{"$f":"IF(CL18=\"\",\"\",ROUND((CL20+CL24+CL26)/(Anlage_Installation!$C$15-Verbraucher_Consommateurs!CL18),3))","v":""},{"$f":"IF(CM18=\"\",\"\",ROUND((CM20+CM24+CM26)/(Anlage_Installation!$C$15-Verbraucher_Consommateurs!CM18),3))","v":""},{"$f":"IF(CN18=\"\",\"\",ROUND((CN20+CN24+CN26)/(Anlage_Installation!$C$15-Verbraucher_Consommateurs!CN18),3))","v":""},{"$f":"IF(CO18=\"\",\"\",ROUND((CO20+CO24+CO26)/(Anlage_Installation!$C$15-Verbraucher_Consommateurs!CO18),3))","v":""},{"$f":"IF(CP18=\"\",\"\",ROUND((CP20+CP24+CP26)/(Anlage_Installation!$C$15-Verbraucher_Consommateurs!CP18),3))","v":""},{"$f":"IF(CQ18=\"\",\"\",ROUND((CQ20+CQ24+CQ26)/(Anlage_Installation!$C$15-Verbraucher_Consommateurs!CQ18),3))","v":""},{"$f":"IF(CR18=\"\",\"\",ROUND((CR20+CR24+CR26)/(Anlage_Installation!$C$15-Verbraucher_Consommateurs!CR18),3))","v":""},{"$f":"IF(CS18=\"\",\"\",ROUND((CS20+CS24+CS26)/(Anlage_Installation!$C$15-Verbraucher_Consommateurs!CS18),3))","v":""},{"$f":"IF(CT18=\"\",\"\",ROUND((CT20+CT24+CT26)/(Anlage_Installation!$C$15-Verbraucher_Consommateurs!CT18),3))","v":""},{"$f":"IF(CU18=\"\",\"\",ROUND((CU20+CU24+CU26)/(Anlage_Installation!$C$15-Verbraucher_Consommateurs!CU18),3))","v":""},{"$f":"IF(CV18=\"\",\"\",ROUND((CV20+CV24+CV26)/(Anlage_Installation!$C$15-Verbraucher_Consommateurs!CV18),3))","v":""},{"$f":"IF(CW18=\"\",\"\",ROUND((CW20+CW24+CW26)/(Anlage_Installation!$C$15-Verbraucher_Consommateurs!CW18),3))","v":""},{"$f":"IF(CX18=\"\",\"\",ROUND((CX20+CX24+CX26)/(Anlage_Installation!$C$15-Verbraucher_Consommateurs!CX18),3))","v":""},{"$f":"IF(CY18=\"\",\"\",ROUND((CY20+CY24+CY26)/(Anlage_Installation!$C$15-Verbraucher_Consommateurs!CY18),3))","v":""},{"$f":"IF(CZ18=\"\",\"\",ROUND((CZ20+CZ24+CZ26)/(Anlage_Installation!$C$15-Verbraucher_Consommateurs!CZ18),3))","v":""},{"$f":"IF(DA18=\"\",\"\",ROUND((DA20+DA24+DA26)/(Anlage_Installation!$C$15-Verbraucher_Consommateurs!DA18),3))","v":""},{"$f":"IF(DB18=\"\",\"\",ROUND((DB20+DB24+DB26)/(Anlage_Installation!$C$15-Verbraucher_Consommateurs!DB18),3))","v":""},{"$f":"IF(DC18=\"\",\"\",ROUND((DC20+DC24+DC26)/(Anlage_Installation!$C$15-Verbraucher_Consommateurs!DC18),3))","v":""},{"$f":"IF(DD18=\"\",\"\",ROUND((DD20+DD24+DD26)/(Anlage_Installation!$C$15-Verbraucher_Consommateurs!DD18),3))","v":""},{"$f":"IF(DE18=\"\",\"\",ROUND((DE20+DE24+DE26)/(Anlage_Installation!$C$15-Verbraucher_Consommateurs!DE18),3))","v":""},{"$f":"IF(DF18=\"\",\"\",ROUND((DF20+DF24+DF26)/(Anlage_Installation!$C$15-Verbraucher_Consommateurs!DF18),3))","v":""},{"$f":"IF(DG18=\"\",\"\",ROUND((DG20+DG24+DG26)/(Anlage_Installation!$C$15-Verbraucher_Consommateurs!DG18),3))","v":""},{"$f":"IF(DH18=\"\",\"\",ROUND((DH20+DH24+DH26)/(Anlage_Installation!$C$15-Verbraucher_Consommateurs!DH18),3))","v":""},{"$f":"IF(DI18=\"\",\"\",ROUND((DI20+DI24+DI26)/(Anlage_Installation!$C$15-Verbraucher_Consommateurs!DI18),3))","v":""},{"$f":"IF(DJ18=\"\",\"\",ROUND((DJ20+DJ24+DJ26)/(Anlage_Installation!$C$15-Verbraucher_Consommateurs!DJ18),3))","v":""},{"$f":"IF(DK18=\"\",\"\",ROUND((DK20+DK24+DK26)/(Anlage_Installation!$C$15-Verbraucher_Consommateurs!DK18),3))","v":""},{"$f":"IF(DL18=\"\",\"\",ROUND((DL20+DL24+DL26)/(Anlage_Installation!$C$15-Verbraucher_Consommateurs!DL18),3))","v":""},{"$f":"IF(DM18=\"\",\"\",ROUND((DM20+DM24+DM26)/(Anlage_Installation!$C$15-Verbraucher_Consommateurs!DM18),3))","v":""},{"$f":"IF(DN18=\"\",\"\",ROUND((DN20+DN24+DN26)/(Anlage_Installation!$C$15-Verbraucher_Consommateurs!DN18),3))","v":""},{"$f":"IF(DO18=\"\",\"\",ROUND((DO20+DO24+DO26)/(Anlage_Installation!$C$15-Verbraucher_Consommateurs!DO18),3))","v":""},{"$f":"IF(DP18=\"\",\"\",ROUND((DP20+DP24+DP26)/(Anlage_Installation!$C$15-Verbraucher_Consommateurs!DP18),3))","v":""},{"$f":"IF(DQ18=\"\",\"\",ROUND((DQ20+DQ24+DQ26)/(Anlage_Installation!$C$15-Verbraucher_Consommateurs!DQ18),3))","v":""},{"$f":"IF(DR18=\"\",\"\",ROUND((DR20+DR24+DR26)/(Anlage_Installation!$C$15-Verbraucher_Consommateurs!DR18),3))","v":""},{"$f":"IF(DS18=\"\",\"\",ROUND((DS20+DS24+DS26)/(Anlage_Installation!$C$15-Verbraucher_Consommateurs!DS18),3))","v":""},{"$f":"IF(DT18=\"\",\"\",ROUND((DT20+DT24+DT26)/(Anlage_Installation!$C$15-Verbraucher_Consommateurs!DT18),3))","v":""},{"$f":"IF(DU18=\"\",\"\",ROUND((DU20+DU24+DU26)/(Anlage_Installation!$C$15-Verbraucher_Consommateurs!DU18),3))","v":""},{"$f":"IF(DV18=\"\",\"\",ROUND((DV20+DV24+DV26)/(Anlage_Installation!$C$15-Verbraucher_Consommateurs!DV18),3))","v":""},{"$f":"IF(DW18=\"\",\"\",ROUND((DW20+DW24+DW26)/(Anlage_Installation!$C$15-Verbraucher_Consommateurs!DW18),3))","v":""},{"$f":"IF(DX18=\"\",\"\",ROUND((DX20+DX24+DX26)/(Anlage_Installation!$C$15-Verbraucher_Consommateurs!DX18),3))","v":""},{"$f":"IF(DY18=\"\",\"\",ROUND((DY20+DY24+DY26)/(Anlage_Installation!$C$15-Verbraucher_Consommateurs!DY18),3))","v":""},{"$f":"IF(DZ18=\"\",\"\",ROUND((DZ20+DZ24+DZ26)/(Anlage_Installation!$C$15-Verbraucher_Consommateurs!DZ18),3))","v":""},{"$f":"IF(EA18=\"\",\"\",ROUND((EA20+EA24+EA26)/(Anlage_Installation!$C$15-Verbraucher_Consommateurs!EA18),3))","v":""},{"$f":"IF(EB18=\"\",\"\",ROUND((EB20+EB24+EB26)/(Anlage_Installation!$C$15-Verbraucher_Consommateurs!EB18),3))","v":""},{"$f":"IF(EC18=\"\",\"\",ROUND((EC20+EC24+EC26)/(Anlage_Installation!$C$15-Verbraucher_Consommateurs!EC18),3))","v":""},{"$f":"IF(ED18=\"\",\"\",ROUND((ED20+ED24+ED26)/(Anlage_Installation!$C$15-Verbraucher_Consommateurs!ED18),3))","v":""},{"$f":"IF(EE18=\"\",\"\",ROUND((EE20+EE24+EE26)/(Anlage_Installation!$C$15-Verbraucher_Consommateurs!EE18),3))","v":""},{"$f":"IF(EF18=\"\",\"\",ROUND((EF20+EF24+EF26)/(Anlage_Installation!$C$15-Verbraucher_Consommateurs!EF18),3))","v":""},{"$f":"IF(EG18=\"\",\"\",ROUND((EG20+EG24+EG26)/(Anlage_Installation!$C$15-Verbraucher_Consommateurs!EG18),3))","v":""},{"$f":"IF(EH18=\"\",\"\",ROUND((EH20+EH24+EH26)/(Anlage_Installation!$C$15-Verbraucher_Consommateurs!EH18),3))","v":""},{"$f":"IF(EI18=\"\",\"\",ROUND((EI20+EI24+EI26)/(Anlage_Installation!$C$15-Verbraucher_Consommateurs!EI18),3))","v":""},{"$f":"IF(EJ18=\"\",\"\",ROUND((EJ20+EJ24+EJ26)/(Anlage_Installation!$C$15-Verbraucher_Consommateurs!EJ18),3))","v":""},{"$f":"IF(EK18=\"\",\"\",ROUND((EK20+EK24+EK26)/(Anlage_Installation!$C$15-Verbraucher_Consommateurs!EK18),3))","v":""},{"$f":"IF(EL18=\"\",\"\",ROUND((EL20+EL24+EL26)/(Anlage_Installation!$C$15-Verbraucher_Consommateurs!EL18),3))","v":""},{"$f":"IF(EM18=\"\",\"\",ROUND((EM20+EM24+EM26)/(Anlage_Installation!$C$15-Verbraucher_Consommateurs!EM18),3))","v":""},{"$f":"IF(EN18=\"\",\"\",ROUND((EN20+EN24+EN26)/(Anlage_Installation!$C$15-Verbraucher_Consommateurs!EN18),3))","v":""},{"$f":"IF(EO18=\"\",\"\",ROUND((EO20+EO24+EO26)/(Anlage_Installation!$C$15-Verbraucher_Consommateurs!EO18),3))","v":""},{"$f":"IF(EP18=\"\",\"\",ROUND((EP20+EP24+EP26)/(Anlage_Installation!$C$15-Verbraucher_Consommateurs!EP18),3))","v":""},{"$f":"IF(EQ18=\"\",\"\",ROUND((EQ20+EQ24+EQ26)/(Anlage_Installation!$C$15-Verbraucher_Consommateurs!EQ18),3))","v":""},{"$f":"IF(ER18=\"\",\"\",ROUND((ER20+ER24+ER26)/(Anlage_Installation!$C$15-Verbraucher_Consommateurs!ER18),3))","v":""},{"$f":"IF(ES18=\"\",\"\",ROUND((ES20+ES24+ES26)/(Anlage_Installation!$C$15-Verbraucher_Consommateurs!ES18),3))","v":""},{"$f":"IF(ET18=\"\",\"\",ROUND((ET20+ET24+ET26)/(Anlage_Installation!$C$15-Verbraucher_Consommateurs!ET18),3))","v":""},{"$f":"IF(EU18=\"\",\"\",ROUND((EU20+EU24+EU26)/(Anlage_Installation!$C$15-Verbraucher_Consommateurs!EU18),3))","v":""},{"$f":"IF(EV18=\"\",\"\",ROUND((EV20+EV24+EV26)/(Anlage_Installation!$C$15-Verbraucher_Consommateurs!EV18),3))","v":""},{"$f":"IF(EW18=\"\",\"\",ROUND((EW20+EW24+EW26)/(Anlage_Installation!$C$15-Verbraucher_Consommateurs!EW18),3))","v":""},{"$f":"IF(EX18=\"\",\"\",ROUND((EX20+EX24+EX26)/(Anlage_Installation!$C$15-Verbraucher_Consommateurs!EX18),3))","v":""},{"$f":"IF(EY18=\"\",\"\",ROUND((EY20+EY24+EY26)/(Anlage_Installation!$C$15-Verbraucher_Consommateurs!EY18),3))","v":""},{"$f":"IF(EZ18=\"\",\"\",ROUND((EZ20+EZ24+EZ26)/(Anlage_Installation!$C$15-Verbraucher_Consommateurs!EZ18),3))","v":""},{"$f":"IF(FA18=\"\",\"\",ROUND((FA20+FA24+FA26)/(Anlage_Installation!$C$15-Verbraucher_Consommateurs!FA18),3))","v":""},{"$f":"IF(FB18=\"\",\"\",ROUND((FB20+FB24+FB26)/(Anlage_Installation!$C$15-Verbraucher_Consommateurs!FB18),3))","v":""},{"$f":"IF(FC18=\"\",\"\",ROUND((FC20+FC24+FC26)/(Anlage_Installation!$C$15-Verbraucher_Consommateurs!FC18),3))","v":""},{"$f":"IF(FD18=\"\",\"\",ROUND((FD20+FD24+FD26)/(Anlage_Installation!$C$15-Verbraucher_Consommateurs!FD18),3))","v":""},{"$f":"IF(FE18=\"\",\"\",ROUND((FE20+FE24+FE26)/(Anlage_Installation!$C$15-Verbraucher_Consommateurs!FE18),3))","v":""},{"$f":"IF(FF18=\"\",\"\",ROUND((FF20+FF24+FF26)/(Anlage_Installation!$C$15-Verbraucher_Consommateurs!FF18),3))","v":""},{"$f":"IF(FG18=\"\",\"\",ROUND((FG20+FG24+FG26)/(Anlage_Installation!$C$15-Verbraucher_Consommateurs!FG18),3))","v":""},{"$f":"IF(FH18=\"\",\"\",ROUND((FH20+FH24+FH26)/(Anlage_Installation!$C$15-Verbraucher_Consommateurs!FH18),3))","v":""},{"$f":"IF(FI18=\"\",\"\",ROUND((FI20+FI24+FI26)/(Anlage_Installation!$C$15-Verbraucher_Consommateurs!FI18),3))","v":""},{"$f":"IF(FJ18=\"\",\"\",ROUND((FJ20+FJ24+FJ26)/(Anlage_Installation!$C$15-Verbraucher_Consommateurs!FJ18),3))","v":""},{"$f":"IF(FK18=\"\",\"\",ROUND((FK20+FK24+FK26)/(Anlage_Installation!$C$15-Verbraucher_Consommateurs!FK18),3))","v":""},{"$f":"IF(FL18=\"\",\"\",ROUND((FL20+FL24+FL26)/(Anlage_Installation!$C$15-Verbraucher_Consommateurs!FL18),3))","v":""},{"$f":"IF(FM18=\"\",\"\",ROUND((FM20+FM24+FM26)/(Anlage_Installation!$C$15-Verbraucher_Consommateurs!FM18),3))","v":""},{"$f":"IF(FN18=\"\",\"\",ROUND((FN20+FN24+FN26)/(Anlage_Installation!$C$15-Verbraucher_Consommateurs!FN18),3))","v":""},{"$f":"IF(FO18=\"\",\"\",ROUND((FO20+FO24+FO26)/(Anlage_Installation!$C$15-Verbraucher_Consommateurs!FO18),3))","v":""},{"$f":"IF(FP18=\"\",\"\",ROUND((FP20+FP24+FP26)/(Anlage_Installation!$C$15-Verbraucher_Consommateurs!FP18),3))","v":""},{"$f":"IF(FQ18=\"\",\"\",ROUND((FQ20+FQ24+FQ26)/(Anlage_Installation!$C$15-Verbraucher_Consommateurs!FQ18),3))","v":""},{"$f":"IF(FR18=\"\",\"\",ROUND((FR20+FR24+FR26)/(Anlage_Installation!$C$15-Verbraucher_Consommateurs!FR18),3))","v":""},{"$f":"IF(FS18=\"\",\"\",ROUND((FS20+FS24+FS26)/(Anlage_Installation!$C$15-Verbraucher_Consommateurs!FS18),3))","v":""},{"$f":"IF(FT18=\"\",\"\",ROUND((FT20+FT24+FT26)/(Anlage_Installation!$C$15-Verbraucher_Consommateurs!FT18),3))","v":""},{"$f":"IF(FU18=\"\",\"\",ROUND((FU20+FU24+FU26)/(Anlage_Installation!$C$15-Verbraucher_Consommateurs!FU18),3))","v":""},{"$f":"IF(FV18=\"\",\"\",ROUND((FV20+FV24+FV26)/(Anlage_Installation!$C$15-Verbraucher_Consommateurs!FV18),3))","v":""},{"$f":"IF(FW18=\"\",\"\",ROUND((FW20+FW24+FW26)/(Anlage_Installation!$C$15-Verbraucher_Consommateurs!FW18),3))","v":""},{"$f":"IF(FX18=\"\",\"\",ROUND((FX20+FX24+FX26)/(Anlage_Installation!$C$15-Verbraucher_Consommateurs!FX18),3))","v":""},{"$f":"IF(FY18=\"\",\"\",ROUND((FY20+FY24+FY26)/(Anlage_Installation!$C$15-Verbraucher_Consommateurs!FY18),3))","v":""},{"$f":"IF(FZ18=\"\",\"\",ROUND((FZ20+FZ24+FZ26)/(Anlage_Installation!$C$15-Verbraucher_Consommateurs!FZ18),3))","v":""},{"$f":"IF(GA18=\"\",\"\",ROUND((GA20+GA24+GA26)/(Anlage_Installation!$C$15-Verbraucher_Consommateurs!GA18),3))","v":""},{"$f":"IF(GB18=\"\",\"\",ROUND((GB20+GB24+GB26)/(Anlage_Installation!$C$15-Verbraucher_Consommateurs!GB18),3))","v":""},{"$f":"IF(GC18=\"\",\"\",ROUND((GC20+GC24+GC26)/(Anlage_Installation!$C$15-Verbraucher_Consommateurs!GC18),3))","v":""},{"$f":"IF(GD18=\"\",\"\",ROUND((GD20+GD24+GD26)/(Anlage_Installation!$C$15-Verbraucher_Consommateurs!GD18),3))","v":""},{"$f":"IF(GE18=\"\",\"\",ROUND((GE20+GE24+GE26)/(Anlage_Installation!$C$15-Verbraucher_Consommateurs!GE18),3))","v":""},{"$f":"IF(GF18=\"\",\"\",ROUND((GF20+GF24+GF26)/(Anlage_Installation!$C$15-Verbraucher_Consommateurs!GF18),3))","v":""},{"$f":"IF(GG18=\"\",\"\",ROUND((GG20+GG24+GG26)/(Anlage_Installation!$C$15-Verbraucher_Consommateurs!GG18),3))","v":""},{"$f":"IF(GH18=\"\",\"\",ROUND((GH20+GH24+GH26)/(Anlage_Installation!$C$15-Verbraucher_Consommateurs!GH18),3))","v":""},{"$f":"IF(GI18=\"\",\"\",ROUND((GI20+GI24+GI26)/(Anlage_Installation!$C$15-Verbraucher_Consommateurs!GI18),3))","v":""},{"$f":"IF(GJ18=\"\",\"\",ROUND((GJ20+GJ24+GJ26)/(Anlage_Installation!$C$15-Verbraucher_Consommateurs!GJ18),3))","v":""},{"$f":"IF(GK18=\"\",\"\",ROUND((GK20+GK24+GK26)/(Anlage_Installation!$C$15-Verbraucher_Consommateurs!GK18),3))","v":""},{"$f":"IF(GL18=\"\",\"\",ROUND((GL20+GL24+GL26)/(Anlage_Installation!$C$15-Verbraucher_Consommateurs!GL18),3))","v":""},{"$f":"IF(GM18=\"\",\"\",ROUND((GM20+GM24+GM26)/(Anlage_Installation!$C$15-Verbraucher_Consommateurs!GM18),3))","v":""},{"$f":"IF(GN18=\"\",\"\",ROUND((GN20+GN24+GN26)/(Anlage_Installation!$C$15-Verbraucher_Consommateurs!GN18),3))","v":""},{"$f":"IF(GO18=\"\",\"\",ROUND((GO20+GO24+GO26)/(Anlage_Installation!$C$15-Verbraucher_Consommateurs!GO18),3))","v":""},{"$f":"IF(GP18=\"\",\"\",ROUND((GP20+GP24+GP26)/(Anlage_Installation!$C$15-Verbraucher_Consommateurs!GP18),3))","v":""},{"$f":"IF(GQ18=\"\",\"\",ROUND((GQ20+GQ24+GQ26)/(Anlage_Installation!$C$15-Verbraucher_Consommateurs!GQ18),3))","v":""},{"$f":"IF(GR18=\"\",\"\",ROUND((GR20+GR24+GR26)/(Anlage_Installation!$C$15-Verbraucher_Consommateurs!GR18),3))","v":""},{"$f":"IF(GS18=\"\",\"\",ROUND((GS20+GS24+GS26)/(Anlage_Installation!$C$15-Verbraucher_Consommateurs!GS18),3))","v":""},{"$f":"IF(GT18=\"\",\"\",ROUND((GT20+GT24+GT26)/(Anlage_Installation!$C$15-Verbraucher_Consommateurs!GT18),3))","v":""},{"$f":"IF(GU18=\"\",\"\",ROUND((GU20+GU24+GU26)/(Anlage_Installation!$C$15-Verbraucher_Consommateurs!GU18),3))","v":""},{"$f":"IF(GV18=\"\",\"\",ROUND((GV20+GV24+GV26)/(Anlage_Installation!$C$15-Verbraucher_Consommateurs!GV18),3))","v":""},{"$f":"IF(GW18=\"\",\"\",ROUND((GW20+GW24+GW26)/(Anlage_Installation!$C$15-Verbraucher_Consommateurs!GW18),3))","v":""},{"$f":"IF(GX18=\"\",\"\",ROUND((GX20+GX24+GX26)/(Anlage_Installation!$C$15-Verbraucher_Consommateurs!GX18),3))","v":""},{"$f":"IF(GY18=\"\",\"\",ROUND((GY20+GY24+GY26)/(Anlage_Installation!$C$15-Verbraucher_Consommateurs!GY18),3))","v":""},{"$f":"IF(GZ18=\"\",\"\",ROUND((GZ20+GZ24+GZ26)/(Anlage_Installation!$C$15-Verbraucher_Consommateurs!GZ18),3))","v":""},{"$f":"IF(HA18=\"\",\"\",ROUND((HA20+HA24+HA26)/(Anlage_Installation!$C$15-Verbraucher_Consommateurs!HA18),3))","v":""},{"$f":"IF(HB18=\"\",\"\",ROUND((HB20+HB24+HB26)/(Anlage_Installation!$C$15-Verbraucher_Consommateurs!HB18),3))","v":""},{"$f":"IF(HC18=\"\",\"\",ROUND((HC20+HC24+HC26)/(Anlage_Installation!$C$15-Verbraucher_Consommateurs!HC18),3))","v":""},{"$f":"IF(HD18=\"\",\"\",ROUND((HD20+HD24+HD26)/(Anlage_Installation!$C$15-Verbraucher_Consommateurs!HD18),3))","v":""},{"$f":"IF(HE18=\"\",\"\",ROUND((HE20+HE24+HE26)/(Anlage_Installation!$C$15-Verbraucher_Consommateurs!HE18),3))","v":""},{"$f":"IF(HF18=\"\",\"\",ROUND((HF20+HF24+HF26)/(Anlage_Installation!$C$15-Verbraucher_Consommateurs!HF18),3))","v":""},{"$f":"IF(HG18=\"\",\"\",ROUND((HG20+HG24+HG26)/(Anlage_Installation!$C$15-Verbraucher_Consommateurs!HG18),3))","v":""},{"$f":"IF(HH18=\"\",\"\",ROUND((HH20+HH24+HH26)/(Anlage_Installation!$C$15-Verbraucher_Consommateurs!HH18),3))","v":""},{"$f":"IF(HI18=\"\",\"\",ROUND((HI20+HI24+HI26)/(Anlage_Installation!$C$15-Verbraucher_Consommateurs!HI18),3))","v":""},{"$f":"IF(HJ18=\"\",\"\",ROUND((HJ20+HJ24+HJ26)/(Anlage_Installation!$C$15-Verbraucher_Consommateurs!HJ18),3))","v":""},{"$f":"IF(HK18=\"\",\"\",ROUND((HK20+HK24+HK26)/(Anlage_Installation!$C$15-Verbraucher_Consommateurs!HK18),3))","v":""},{"$f":"IF(HL18=\"\",\"\",ROUND((HL20+HL24+HL26)/(Anlage_Installation!$C$15-Verbraucher_Consommateurs!HL18),3))","v":""},{"$f":"IF(HM18=\"\",\"\",ROUND((HM20+HM24+HM26)/(Anlage_Installation!$C$15-Verbraucher_Consommateurs!HM18),3))","v":""},{"$f":"IF(HN18=\"\",\"\",ROUND((HN20+HN24+HN26)/(Anlage_Installation!$C$15-Verbraucher_Consommateurs!HN18),3))","v":""},{"$f":"IF(HO18=\"\",\"\",ROUND((HO20+HO24+HO26)/(Anlage_Installation!$C$15-Verbraucher_Consommateurs!HO18),3))","v":""},{"$f":"IF(HP18=\"\",\"\",ROUND((HP20+HP24+HP26)/(Anlage_Installation!$C$15-Verbraucher_Consommateurs!HP18),3))","v":""},{"$f":"IF(HQ18=\"\",\"\",ROUND((HQ20+HQ24+HQ26)/(Anlage_Installation!$C$15-Verbraucher_Consommateurs!HQ18),3))","v":""},{"$f":"IF(HR18=\"\",\"\",ROUND((HR20+HR24+HR26)/(Anlage_Installation!$C$15-Verbraucher_Consommateurs!HR18),3))","v":""},{"$f":"IF(HS18=\"\",\"\",ROUND((HS20+HS24+HS26)/(Anlage_Installation!$C$15-Verbraucher_Consommateurs!HS18),3))","v":""},{"$f":"IF(HT18=\"\",\"\",ROUND((HT20+HT24+HT26)/(Anlage_Installation!$C$15-Verbraucher_Consommateurs!HT18),3))","v":""},{"$f":"IF(HU18=\"\",\"\",ROUND((HU20+HU24+HU26)/(Anlage_Installation!$C$15-Verbraucher_Consommateurs!HU18),3))","v":""},{"$f":"IF(HV18=\"\",\"\",ROUND((HV20+HV24+HV26)/(Anlage_Installation!$C$15-Verbraucher_Consommateurs!HV18),3))","v":""},{"$f":"IF(HW18=\"\",\"\",ROUND((HW20+HW24+HW26)/(Anlage_Installation!$C$15-Verbraucher_Consommateurs!HW18),3))","v":""},{"$f":"IF(HX18=\"\",\"\",ROUND((HX20+HX24+HX26)/(Anlage_Installation!$C$15-Verbraucher_Consommateurs!HX18),3))","v":""},{"$f":"IF(HY18=\"\",\"\",ROUND((HY20+HY24+HY26)/(Anlage_Installation!$C$15-Verbraucher_Consommateurs!HY18),3))","v":""},{"$f":"IF(HZ18=\"\",\"\",ROUND((HZ20+HZ24+HZ26)/(Anlage_Installation!$C$15-Verbraucher_Consommateurs!HZ18),3))","v":""},{"$f":"IF(IA18=\"\",\"\",ROUND((IA20+IA24+IA26)/(Anlage_Installation!$C$15-Verbraucher_Consommateurs!IA18),3))","v":""},{"$f":"IF(IB18=\"\",\"\",ROUND((IB20+IB24+IB26)/(Anlage_Installation!$C$15-Verbraucher_Consommateurs!IB18),3))","v":""},{"$f":"IF(IC18=\"\",\"\",ROUND((IC20+IC24+IC26)/(Anlage_Installation!$C$15-Verbraucher_Consommateurs!IC18),3))","v":""},{"$f":"IF(ID18=\"\",\"\",ROUND((ID20+ID24+ID26)/(Anlage_Installation!$C$15-Verbraucher_Consommateurs!ID18),3))","v":""},{"$f":"IF(IE18=\"\",\"\",ROUND((IE20+IE24+IE26)/(Anlage_Installation!$C$15-Verbraucher_Consommateurs!IE18),3))","v":""},{"$f":"IF(IF18=\"\",\"\",ROUND((IF20+IF24+IF26)/(Anlage_Installation!$C$15-Verbraucher_Consommateurs!IF18),3))","v":""},{"$f":"IF(IG18=\"\",\"\",ROUND((IG20+IG24+IG26)/(Anlage_Installation!$C$15-Verbraucher_Consommateurs!IG18),3))","v":""},{"$f":"IF(IH18=\"\",\"\",ROUND((IH20+IH24+IH26)/(Anlage_Installation!$C$15-Verbraucher_Consommateurs!IH18),3))","v":""},{"$f":"IF(II18=\"\",\"\",ROUND((II20+II24+II26)/(Anlage_Installation!$C$15-Verbraucher_Consommateurs!II18),3))","v":""},{"$f":"IF(IJ18=\"\",\"\",ROUND((IJ20+IJ24+IJ26)/(Anlage_Installation!$C$15-Verbraucher_Consommateurs!IJ18),3))","v":""},{"$f":"IF(IK18=\"\",\"\",ROUND((IK20+IK24+IK26)/(Anlage_Installation!$C$15-Verbraucher_Consommateurs!IK18),3))","v":""},{"$f":"IF(IL18=\"\",\"\",ROUND((IL20+IL24+IL26)/(Anlage_Installation!$C$15-Verbraucher_Consommateurs!IL18),3))","v":""},{"$f":"IF(IM18=\"\",\"\",ROUND((IM20+IM24+IM26)/(Anlage_Installation!$C$15-Verbraucher_Consommateurs!IM18),3))","v":""},{"$f":"IF(IN18=\"\",\"\",ROUND((IN20+IN24+IN26)/(Anlage_Installation!$C$15-Verbraucher_Consommateurs!IN18),3))","v":""},{"$f":"IF(IO18=\"\",\"\",ROUND((IO20+IO24+IO26)/(Anlage_Installation!$C$15-Verbraucher_Consommateurs!IO18),3))","v":""},{"$f":"IF(IP18=\"\",\"\",ROUND((IP20+IP24+IP26)/(Anlage_Installation!$C$15-Verbraucher_Consommateurs!IP18),3))","v":""},{"$f":"IF(IQ18=\"\",\"\",ROUND((IQ20+IQ24+IQ26)/(Anlage_Installation!$C$15-Verbraucher_Consommateurs!IQ18),3))","v":""},{"$f":"IF(IR18=\"\",\"\",ROUND((IR20+IR24+IR26)/(Anlage_Installation!$C$15-Verbraucher_Consommateurs!IR18),3))","v":""},{"$f":"IF(IS18=\"\",\"\",ROUND((IS20+IS24+IS26)/(Anlage_Installation!$C$15-Verbraucher_Consommateurs!IS18),3))","v":""},{"$f":"IF(IT18=\"\",\"\",ROUND((IT20+IT24+IT26)/(Anlage_Installation!$C$15-Verbraucher_Consommateurs!IT18),3))","v":""},{"$f":"IF(IU18=\"\",\"\",ROUND((IU20+IU24+IU26)/(Anlage_Installation!$C$15-Verbraucher_Consommateurs!IU18),3))","v":""},{"$f":"IF(IV18=\"\",\"\",ROUND((IV20+IV24+IV26)/(Anlage_Installation!$C$15-Verbraucher_Consommateurs!IV18),3))","v":""}]
[null,null,{"$f":"IF(C$20=\"\",\"\",ROUND(C$20*C$21,3))","v":850},{"$f":"IF(D$20=\"\",\"\",ROUND(D$20*D$21,3))","v":382.5},"",7,"","","","","","","","","","","","","","","","","","","","","","","","","","","","","","","","","","","","","","","","","","","","","","","","","","","","","","","","","","","","","",{"$f":"IF(BP$20=\"\",\"\",ROUND(BP$20*BP$21,3))","v":""},"","","","","","","","","","","","","","","","","","","","","","","","","","","","","","","","","","","","","","","","","","","","","","","","","","","","","","","","","","","","","","","",{"$f":"IF(EB$20=\"\",\"\",ROUND(EB$20*EB$21,3))","v":""},"","","","","","","","","","","","","","","","","","","","","","","","","","","","","","","","","","","","","","","","","","","","","","","","","","","","","","","","","","","","","","","",{"$f":"IF(GN$20=\"\",\"\",ROUND(GN$20*GN$21,3))","v":""},"","","","","","","","","","","","","","","","","","","","","","","","","","","","","","","","","","","","","","","","","","","","","","","","","","","","","","","","","","","",""]
[null,null,{"$f":"IF(C$20=\"\",\"\",ROUND(C$20*C$22,3))","v":850},{"$f":"IF(D$20=\"\",\"\",ROUND(D$20*D$22,3))","v":450},"",10,"","","","","","","","","","","","","","","","","","","","","","","","","","","","","","","","","","","","","","","","","","","","","","","","","","","","","","","","","","","","","",{"$f":"IF(BP$20=\"\",\"\",ROUND(BP$20*BP$22,3))","v":""},"","","","","","","","","","","","","","","","","","","","","","","","","","","","","","","","","","","","","","","","","","","","","","","","","","","","","","","","","","","","","","","",{"$f":"IF(EB$20=\"\",\"\",ROUND(EB$20*EB$22,3))","v":""},"","","","","","","","","","","","","","","","","","","","","","","","","","","","","","","","","","","","","","","","","","","","","","","","","","","","","","","","","","","","","","","",{"$f":"IF(GN$20=\"\",\"\",ROUND(GN$20*GN$22,3))","v":""},"","","","","","","","","","","","","","","","","","","","","","","","","","","","","","","","","","","","","","","","","","","","","","","","","","","","","","","","","","","",""]

{"sheet":"Anlage_Installation","index":1,"n_rows":47,"n_cols":5,"rows_kept":47,"cut":false,"hidden":false,"merged":[]}
[{"$f":"Verbraucher_Consommateurs!A1","v":"QM Holzheizwerke"}]
[{"$f":"Verbraucher_Consommateurs!A3","v":"Projekt/Variante:"},{"$f":"IF(Verbraucher_Consommateurs!B3=\"\",\"\",Verbraucher_Consommateurs!B3)","v":"Musterbeispiel (Linie 1)"}]
[null,{"$f":"IF(Verbraucher_Consommateurs!B4=\"\",\"\",Verbraucher_Consommateurs!B4)","v":"Musterbeispiel (Linie 2)"}]
[null,{"$f":"IF(Verbraucher_Consommateurs!B5=\"\",\"\",Verbraucher_Consommateurs!B5)","v":"Musterbeispiel (Linie 3)"}]
[{"$f":"Verbraucher_Consommateurs!A6","v":"Erfasst von:"},{"$f":"IF(Verbraucher_Consommateurs!B6=\"\",\"\",Verbraucher_Consommateurs!B6)","v":"Musterplaner"}]
[{"$f":"Verbraucher_Consommateurs!A7","v":"Datum:"},{"$f":"IF(Verbraucher_Consommateurs!B7=\"\",\"\",Verbraucher_Consommateurs!B7)","v":"2014-05-02"}]
[]
[{"$f":"Text!C47","v":"Eingaben Hauptplaner"}]
[]
[{"$f":"Text!C48","v":"Allgemeines"},{"$f":"Text!C49","v":"Land"}]
[null,{"$f":"Text!C50","v":"Klimastation"}]
[null,{"$f":"Text!C51","v":"Tiefste Aussentemperatur [°C]"},-7,{"$f":"Hilfsblatt!C31","v":-7},{"$f":"Text!C52","v":"°C = 10-Jahres-Mittelwert (2002 - 2011)"}]
[null,{"$f":"Text!C53","v":"Raumtemperatur [°C]"},20]
[null,{"$f":"Text!C54","v":"Heizgrenze [°C]"},15]
[null,{"$f":"Text!C55","v":"Max. Haupt-Vorlauftemperatur [°C]"},85]
[null,{"$f":"Text!C56","v":"Sommerbetrieb"}]
[{"$f":"Text!C57","v":"Raumwärme"},{"$f":"Text!C58","v":"Nicht witterungsabhängiger Anteil Wärmeleistungsbedarf Raumwärme [%]"},5]
[null,{"$f":"Text!C59","v":"Gleichzeitigkeitsfaktor Raumwärme [-]"},1]
[{"$f":"Text!C60","v":"Warmwasser"},{"$f":"Text!C61","v":"Gleichzeitigkeitsfaktor Warmwasser [-]"},1]
[{"$f":"Text!C62","v":"Prozesswärme"},{"$f":"Text!C63","v":"Gleichzeitigkeitsfaktor Prozesswärme [-]"},0.56000000000000005]
[{"$f":"Text!C64","v":"Fernleitung"},{"$f":"Text!C65","v":"Jahres-Wärmeverlust Fernleitung [MWh/a]"},{"$f":"ROUND(C33*0.1,1)","v":393.3}]
[null,{"$f":"Text!C66","v":"Verlustleistung Fernleitung [kW]"},{"$f":"ROUND(C21*1000/8760,1)","v":44.9}]
[]
[{"$f":"Text!C68","v":"Berechnete Summenwerte"}]
[]
[{"$f":"Text!C69","v":"Allgemeines"},{"$f":"Text!C70","v":"Gesamt-Energiebezugsfläche [m²]"},{"$f":"SUM(Verbraucher_Consommateurs!C16:IV16)","v":30400}]
[{"$f":"Text!C71","v":"Raumwärme"},{"$f":"Text!C72","v":"Gesamt-Heizwärmebdarf [MWh/a]"},{"$f":"SUM(Verbraucher_Consommateurs!C19:IV19)","v":2792}]
[null,{"$f":"Text!C73","v":"Max. Gesamt-Wärmeleistungsbedarf Raumwärme [kW]"},{"$f":"SUM(Verbraucher_Consommateurs!C20:IV20)","v":1310}]
[{"$f":"Text!C74","v":"Warmwasser"},{"$f":"Text!C75","v":"Gesamt-Jahreswärmebdarf Warmwasser [MWh/a]"},{"$f":"SUM(Verbraucher_Consommateurs!C23:IV23)","v":641}]
[null,{"$f":"Text!C76","v":"Max. Gesamt-Wärmeleistungsbedarf Warmwasser [kW]"},{"$f":"SUM(Verbraucher_Consommateurs!C24:IV24)","v":152.5}]
[{"$f":"Text!C77","v":"Prozesswärme"},{"$f":"Text!C78","v":"Gesamt-Jahreswärmebdarf Prozesswärme [MWh/a]"},{"$f":"SUM(Verbraucher_Consommateurs!C25:IV25)","v":500}]
[null,{"$f":"Text!C79","v":"Max. Gesamt-Wärmeleistungsbedarf Prozesswärme [kW]"},{"$f":"SUM(Verbraucher_Consommateurs!C26:IV26)","v":100}]
[{"$f":"Text!C80","v":"∑ Wärmeabnehmer"},{"$f":"Text!C81","v":"Gesamt-Wärmebedarf [MWh/a]"},{"$f":"C27+C29+C31","v":3933}]
[null,{"$f":"Text!C82","v":"Gesamt-Wärmeleistungbedarf [kW]"},{"$f":"C28+C30+C32","v":1562.5}]
[]
[{"$f":"Text!C84","v":"Berechnete Kennzahlen"}]
[]
[{"$f":"Text!C85","v":"Allgemeines"},{"$f":"Text!C86","v":"Max. Vorlauftemperatur Wärmeabnehmer [°C]"},{"$f":"MAX(Verbraucher_Consommateurs!C17:IV17)","v":80}]
[null,{"$f":"Text!C87","v":"Max. Hauptrücklauftemperatur [°C]"},{"$f":"ROUND(C15-(C28+C30+C32)/SUM(Verbraucher_Consommateurs!C48:IV48),3)","v":52.561}]
[{"$f":"Text!C88","v":"Raumwärme"},{"$f":"Text!C89","v":"Vollbetriebsstundenzahl Raumwärme [h/a]"},{"$f":"ROUND(C27*1000/C28,2)","v":2131.3000000000002}]
[null,{"$f":"Text!C90","v":"Spezifischer Heizwärmebedarf [kWh/m²a]"},{"$f":"ROUND(C27*1000/C$26,3)","v":91.841999999999999}]
[null,{"$f":"Text!C91","v":"Spezifischer Wärmeleistungsbedarf [W/m²]"},{"$f":"ROUND(C28*1000/C$26,3)","v":43.091999999999999}]
[{"$f":"Text!C92","v":"Warmwasser"},{"$f":"Text!C93","v":"Vollbetriebsstundenzahl Warmwasser [h/a]"},{"$f":"ROUND(C29*1000/C30,2)","v":4203.28}]
[null,{"$f":"Text!C94","v":"Spezifischer Energiebedarf Warmwasser [kWh/m²a]"},{"$f":"ROUND(C29*1000/C$26,3)","v":21.085999999999999}]
[{"$f":"Text!C95","v":"Prozesswärme"},{"$f":"Text!C96","v":"Vollbetriebsstundenzahl Prozesswärme [h/a]"},{"$f":"ROUND(C31*1000/C32,2)","v":5000}]
[null,{"$f":"Verbraucher_Consommateurs!B42","v":"Situationserfassung V35"}]
[{"$f":"Verbraucher_Consommateurs!A42","v":"Eingabefelder"},{"$f":"Verbraucher_Consommateurs!B43","v":"Empfohlene Dateiformate: .xlsm oder .xls (Excel 97-2004)"}]

{"sheet":"Wärmezentrale_CentraleThermique","index":2,"n_rows":38,"n_cols":10,"rows_kept":38,"cut":false,"hidden":false,"merged":[]}
[{"$f":"Verbraucher_Consommateurs!A1","v":"QM Holzheizwerke"}]
[{"$f":"Verbraucher_Consommateurs!A3","v":"Projekt/Variante:"},{"$f":"IF(Verbraucher_Consommateurs!B3=\"\",\"\",Verbraucher_Consommateurs!B3)","v":"Musterbeispiel (Linie 1)"}]
[null,{"$f":"IF(Verbraucher_Consommateurs!B4=\"\",\"\",Verbraucher_Consommateurs!B4)","v":"Musterbeispiel (Linie 2)"}]
[null,{"$f":"IF(Verbraucher_Consommateurs!B5=\"\",\"\",Verbraucher_Consommateurs!B5)","v":"Musterbeispiel (Linie 3)"}]
[{"$f":"Verbraucher_Consommateurs!A6","v":"Erfasst von:"},{"$f":"IF(Verbraucher_Consommateurs!B6=\"\",\"\",Verbraucher_Consommateurs!B6)","v":"Musterplaner"}]
[{"$f":"Verbraucher_Consommateurs!A7","v":"Datum:"},{"$f":"IF(Verbraucher_Consommateurs!B7=\"\",\"\",Verbraucher_Consommateurs!B7)","v":"2014-05-02"}]
[]
[{"$f":"Text!C195","v":"Eingaben Hauptplaner"}]
[]
[{"$f":"Text!C200","v":"Wärmezentrale"},{"$f":"Text!C201","v":"Standard-Schaltung nach QMH"},null,"WE4",{"$f":"IF(D10=Text!C233,Text!C241,IF(D10=Text!C234,Text!C242,IF(D10=Text!C235,Text!C243,IF(D10=Text!C236,Text!C244,IF(D10=Text!C237,Text!C245,IF(D10=Text!C238,Text!C246,IF(D10=Text!C239,Text!C247,IF(D10=Text!C240,Text!C248,Text!C228))))))))","v":"1 Holzkessel + 1 Öl-/Gaskessel mit Speicher"}]
[null,{"$f":"Text!C202","v":"Nennleistung Holzkessel 1 (kl. Kessel bei WE1 – WE8) [kW]"},null,900,{"$f":"IF(ISBLANK(D11),Text!C229,\"\")","v":""}]
[null,{"$f":"Text!C203","v":"Nennleistung Holzkessel 2 (gr. Kessel bei WE5 – WE8) [kW]"},null,null,{"$f":"IF(AND(ISBLANK(D12),OR(D10=Text!C237,D10=Text!C238,D10=Text!C239,D10=Text!C240,D10=Text!C199)),Text!C229,IF(AND(ISBLANK(D12)=FALSE,OR(D10=Text!C233,D10=Text!C234,D10=Text!C235,D10=Text!C236)),Text!C230,\"\"))","v":""}]
[null,{"$f":"Text!C204","v":"Nennleistung weitere Holzkessel Total [kW]"},null,null,{"$f":"IF(AND(ISBLANK(D13),D10=Text!C199),Text!C229,IF(AND(ISBLANK(D13)=FALSE,OR(D10=Text!C233,D10=Text!C234,D10=Text!C235,D10=Text!C236,D10=Text!C237,D10=Text!C238,D10=Text!C239,D10=Text!C240)),Text!C230,\"\"))","v":""}]
[null,{"$f":"Text!C205","v":"Anzahl installierte Holzkessel bei mehr als zwei Holzkessel [–]"},null,null,{"$f":"IF(AND(ISBLANK(D14),D10=Text!C199),Text!C229,IF(AND(ISBLANK(D14)=FALSE,OR(D10=Text!C233,D10=Text!C234,D10=Text!C235,D10=Text!C236,D10=Text!C237,D10=Text!C238,D10=Text!C239,D10=Text!C240)),Text!C230,\"\"))","v":""}]
[null,{"$f":"Text!C206","v":"Nennleistung Holzkessel Total [kW]"},null,{"$f":"D11+D12+D13","v":900}]
[null,{"$f":"Text!C207","v":"Nennleistung Bivalenkessel Total (z.B. Öl, Gas) [kW]"},null,1500,{"$f":"IF(AND(ISBLANK(D16),OR(D10=Text!C235,D10=Text!C236,D10=Text!C239,D10=Text!C240)),Text!C229,IF(AND(ISBLANK(D16)=FALSE,OR(D10=Text!C233,D10=Text!C234,D10=Text!C237,D10=Text!C238)),Text!C230,\"\"))","v":""}]
[]
[null,{"$f":"Text!C208","v":"Installiertes Speichervolumen [m3]"},null,30,{"$f":"IF(AND(ISBLANK(D18),OR(D10=Text!C234,D10=Text!C236,D10=Text!C238,D10=Text!C240,D10=Text!C199)),Text!C229,IF(AND(ISBLANK(D18)=FALSE,OR(D10=Text!C233,D10=Text!C235,D10=Text!C237,D10=Text!C239)),Text!C230,\"\"))","v":""}]
[null,{"$f":"Text!C209","v":"Temperaturspreizung über dem Speicher (Vorlauf – Rücklauf) [K]"},{"$f":"IF(OR(D10=Text!C234,D10=Text!C236,D10=Text!C238,D10=Text!C240,D10=Text!C199),\"*\"&ROUND(Anlage_Installation!C15-Anlage_Installation!C39,1)&\" K\",\"\")","v":"*32.4 K"},30,{"$f":"IF(AND(ISBLANK(D19),OR(D10=Text!C234,D10=Text!C236,D10=Text!C238,D10=Text!C240,D10=Text!C199)),Text!C229,IF(AND(ISBLANK(D19)=FALSE,OR(D10=Text!C233,D10=Text!C235,D10=Text!C237,D10=Text!C239)),Text!C230,\"\"))","v":""}]
[null,{"$f":"Text!C210","v":"Minimale mittlere Tagesheizlast bei Schwachlastbetrieb (siehe Tabelle 20 unten) [%]"},null,0.15,{"$f":"IF(ISBLANK(D20),Text!C231,\"\")","v":""}]
[null,{"$f":"Text!C211","v":"Maximale mittlere Holzkessel-Tagesleistung (Wert von 70% bis 100%)"},null,0.9,{"$f":"IF(ISBLANK(D21),Text!C232,\"\")","v":""}]
[null,{"$f":"Text!C251","v":"Max. mittlere Bandquellen-Tagesleist. [kW]"},null,0]
[null,{"$f":"\"* \"&Text!C250","v":"* Temperaturspreizung berechnet aus Eingabedaten"}]
[]
[{"$f":"Text!C196","v":"Berechnete Kennzahlen"},null,null,{"$f":"Text!C225","v":"Ergebnis"},{"$f":"Text!C226","v":"Vergleich"}]
[]
[{"$f":"Text!C200","v":"Wärmezentrale"},{"$f":"Text!C212","v":"Vollbetriebsstundenzahl der/des Holzkessel [h/a]"},null,{"$f":"Hilfsblatt!I11*1000/Wärmezentrale_CentraleThermique!D15*(Hilfsblatt!L15/100)","v":4558.4639993995524},{"$f":"IF(D10=Text!C233,1500,IF(D10=Text!C234,2000,IF(D10=Text!C235,2500,IF(D10=Text!C236,3500,IF(D10=Text!C237,1500,IF(D10=Text!C238,2000,IF(D10=Text!C239,2500,IF(D10=Text!C240,3000,\"–\"))))))))","v":3500},{"$f":"Text!C222","v":"Ergebnis ≥ als Vergleichswert"}]
[null,{"$f":"Text!C213","v":"Vollbetriebsstundenzahl Bivalentkessel [h/a]"},null,{"$f":"IF(OR(ISNUMBER(D16)=FALSE,D16=0),\"–\",(Hilfsblatt!L11-Hilfsblatt!L12-Hilfsblatt!L13)*1000/Wärmezentrale_CentraleThermique!D16)","v":149.32247466666681},"–"]
[null,{"$f":"Text!C214","v":"Jahreswärmeproduktion mit Holz [%]"},null,{"$f":"ROUND(Hilfsblatt!L15/100,3)","v":0.94799999999999995},{"$f":"IF(D10=Text!C233,1,IF(D10=Text!C234,1,IF(D10=Text!C235,0.8,IF(D10=Text!C236,0.8,IF(D10=Text!C237,1,IF(D10=Text!C238,1,IF(D10=Text!C239,0.8,IF(D10=Text!C240,0.8,1))))))))","v":0.8},{"$f":"Text!C222","v":"Ergebnis ≥ als Vergleichswert"}]
[null,{"$f":"Text!C215","v":"Speichergrösse [m3]"},null,{"$f":"IF(ISBLANK(D18),\"–\",ROUND(D18,1))","v":30},{"$f":"IF(D10=Text!C233,\"–\",IF(D10=Text!C234,D11/(1.14*D19),IF(D10=Text!C235,\"–\",IF(D10=Text!C236,D11/(1.14*D19),IF(D10=Text!C237,\"–\",IF(D10=Text!C238,2*D15/(3*1.14*D19),IF(D10=Text!C239,\"–\",IF(D10=Text!C240,2*D15/(3*1.14*D19),2*D15/(3*1.14*D19)))))))))","v":26.315789473684212},{"$f":"Text!C222","v":"Ergebnis ≥ als Vergleichswert"}]
[null,{"$f":"Text!C216","v":"Schwachlastbedingung [kW]"},null,{"$f":"ROUND(D20*D11,1)","v":135},{"$f":"IF(Hilfsblatt!S1=\"Nein\",Hilfsblatt!F19-Hilfsblatt!AA31,Hilfsblatt!F20-Hilfsblatt!AA31)","v":175.15199999999999},{"$f":"Text!C223","v":"Ergebnis ≤ als Vergleichswert (Zielwert)"},null,"Untere Grenze","Obere Grenze","zur Beurteilung"]
[null,{"$f":"IF(D10=Text!C233,Text!C217,IF(D10=Text!C234,Text!C217,IF(D10=Text!C235,Text!C217,IF(D10=Text!C236,Text!C217,IF(D10=Text!C237,Text!C218,IF(D10=Text!C238,Text!C218,IF(D10=Text!C239,Text!C218,IF(D10=Text!C240,Text!C218,Text!C217))))))))","v":"Auslegung Holzkessel"},null,{"$f":"IF(D10=Text!C233,D11/Hilfsblatt!F5,IF(D10=Text!C234,D11/Hilfsblatt!F18,IF(D10=Text!C235,D11/Hilfsblatt!F5,IF(D10=Text!C236,D11/Hilfsblatt!F5,IF(D10=Text!C237,D11/Hilfsblatt!F5,IF(D10=Text!C238,D11/Hilfsblatt!F18,IF(D10=Text!C239,D11/Hilfsblatt!F5,IF(D10=Text!C240,D11/Hilfsblatt!F5,D15/Hilfsblatt!F18))))))))","v":0.57566841499296406},{"$f":"IF(D10=Text!C233,\"100%\",IF(D10=Text!C234,\"100%\",IF(D10=Text!C235,\"60% – 70%\",IF(D10=Text!C236,\"50% – 60%\",IF(D10=Text!C237,\"±33%\",IF(D10=Text!C238,\"±33%\",IF(D10=Text!C239,\"20% – 23%\",IF(D10=Text!C240,\"17% – 20%\",\"100%\"))))))))","v":"50% – 60%"},{"$f":"Text!C224","v":"Ergebnis ≥ oder ≤ als Vergleichswert (Zielbereich)"},null,{"$f":"IF(D10=Text!C233,1,IF(D10=Text!C234,1,IF(D10=Text!C235,0.6,IF(D10=Text!C236,0.5,IF(D10=Text!C237,0.305,IF(D10=Text!C238,0.305,IF(D10=Text!C239,0.2,IF(D10=Text!C240,0.17,1))))))))","v":0.5},{"$f":"IF(D10=Text!C233,1.1,IF(D10=Text!C234,1.1,IF(D10=Text!C235,0.7,IF(D10=Text!C236,0.6,IF(D10=Text!C237,0.38,IF(D10=Text!C238,0.38,IF(D10=Text!C239,0.23,IF(D10=Text!C240,0.2,1.1))))))))","v":0.6}]
[null,{"$f":"IF(D10=Text!C233,\"\",IF(D10=Text!C234,\"\",IF(D10=Text!C235,\"\",IF(D10=Text!C236,\"\",IF(D10=Text!C237,Text!C219,IF(D10=Text!C238,Text!C219,IF(D10=Text!C239,Text!C219,IF(D10=Text!C240,Text!C219,\"\"))))))))","v":""},null,{"$f":"IF(D10=Text!C233,\"–\",IF(D10=Text!C234,\"–\",IF(D10=Text!C2333,\"–\",IF(D10=Text!C236,\"–\",IF(D10=Text!C237,D12/Hilfsblatt!F18,IF(D10=Text!C238,D12/Hilfsblatt!F18,IF(D10=Text!C239,D12/Hilfsblatt!F5,IF(D10=Text!C240,D12/Hilfsblatt!F5,\"–\"))))))))","v":"–"},{"$f":"IF(D10=Text!C233,\"–\",IF(D10=Text!C234,\"–\",IF(D10=Text!C235,\"–\",IF(D10=Text!C236,\"–\",IF(D10=Text!C237,\"±67%\",IF(D10=Text!C238,\"±67%\",IF(D10=Text!C239,\"40% – 47%\",IF(D10=Text!C240,\"33% – 40%\",\"–\"))))))))","v":"–"},{"$f":"Text!C224","v":"Ergebnis ≥ oder ≤ als Vergleichswert (Zielbereich)"},null,{"$f":"IF(D10=Text!C233,\"–\",IF(D10=Text!C234,\"–\",IF(D10=Text!C235,\"–\",IF(D10=Text!C236,\"–\",IF(D10=Text!C237,0.645,IF(D10=Text!C238,0.645,IF(D10=Text!C239,0.4,IF(D10=Text!C240,0.33,\"–\"))))))))","v":"–"},{"$f":"IF(D10=Text!C233,\"–\",IF(D10=Text!C234,\"–\",IF(D10=Text!C235,\"–\",IF(D10=Text!C236,\"–\",IF(D10=Text!C237,0.72,IF(D10=Text!C238,0.72,IF(D10=Text!C239,0.47,IF(D10=Text!C240,0.4,\"–\"))))))))","v":"–"}]
[null,{"$f":"IF(D10=Text!C233,\"\",IF(D10=Text!C234,\"\",IF(D10=Text!C235,\"\",IF(D10=Text!C236,\"\",IF(D10=Text!C237,Text!C220,IF(D10=Text!C238,Text!C220,IF(D10=Text!C239,Text!C220,IF(D10=Text!C240,Text!C220,\"\"))))))))","v":""},null,{"$f":"IF(D10=Text!C233,\"–\",IF(D10=Text!C234,\"–\",IF(D10=Text!C235,\"–\",IF(D10=Text!C236,\"–\",IF(D10=Text!C237,D32+D33,IF(D10=Text!C238,D32+D33,IF(D10=Text!C239,D32+D33,IF(D10=Text!C240,D32+D33,\"–\"))))))))","v":"–"},{"$f":"IF(D10=Text!C233,\"–\",IF(D10=Text!C234,\"–\",IF(D10=Text!C235,\"–\",IF(D10=Text!C236,\"–\",IF(D10=Text!C237,\"100%\",IF(D10=Text!C238,\"100%\",IF(D10=Text!C239,\"60% – 70%\",IF(D10=Text!C240,\"50% – 60%\",\"–\"))))))))","v":"–"},{"$f":"Text!C224","v":"Ergebnis ≥ oder ≤ als Vergleichswert (Zielbereich)"},null,{"$f":"H32+H33","v":{"$error":"#VALUE!"}},{"$f":"I32+I33","v":{"$error":"#VALUE!"}}]
[null,{"$f":"Text!C221","v":"Auslegung Bivalentkessel [kW]"},null,{"$f":"IF(ISBLANK(D16),\"–\",D16)","v":1500},{"$f":"IF(D10=Text!C233,\"–\",IF(D10=Text!C234,\"–\",IF(D10=Text!C235,ROUND(0.7*Hilfsblatt!F5,0)&\" kW – \"&ROUND(Hilfsblatt!F5,0)&\" kW\",IF(D10=Text!C236,ROUND(0.7*Hilfsblatt!F5,0)&\" kW – \"&ROUND(Hilfsblatt!F5,0)&\" kW\",IF(D10=Text!C237,\"–\",IF(D10=Text!C238,\"–\",IF(D10=Text!C239,ROUND(Hilfsblatt!F5-D11,0)&\" kW – \"&ROUND(Hilfsblatt!F5,0)&\" kW\",IF(D10=Text!C240,ROUND(Hilfsblatt!F5-D11,0)&\" kW – \"&ROUND(Hilfsblatt!F5,0)&\" kW\",\"–\"))))))))","v":"1094 kW – 1563 kW"},{"$f":"Text!C224","v":"Ergebnis ≥ oder ≤ als Vergleichswert (Zielbereich)"},null,{"$f":"IF(D10=Text!C233,\"–\",IF(D10=Text!C234,\"–\",IF(D10=Text!C235,0.7*Hilfsblatt!F5,IF(D10=Text!C236,0.7*Hilfsblatt!F5,IF(D10=Text!C237,\"–\",IF(D10=Text!C238,\"–\",IF(D10=Text!C239,Hilfsblatt!F5-D11,IF(D10=Text!C240,Hilfsblatt!F5-D11,\"–\"))))))))","v":1094.3799999999999},{"$f":"IF(D10=Text!C233,\"–\",IF(D10=Text!C234,\"–\",IF(D10=Text!C235,Hilfsblatt!F5,IF(D10=Text!C236,Hilfsblatt!F5,IF(D10=Text!C237,\"–\",IF(D10=Text!C238,\"–\",IF(D10=Text!C239,Hilfsblatt!F5,IF(D10=Text!C240,Hilfsblatt!F5,\"–\"))))))))","v":1563.4}]
[null,{"$f":"Text!C249","v":"Vergleich Leistungsdaten mit Energiedaten (Grafik unten Links in Bilder_DE)"},null,{"$f":"ROUND(Hilfsblatt!J4/Hilfsblatt!I4,3)","v":1.002},{"$f":"IF(D10=Text!C233,\"100% – 110%\",IF(D10=Text!C234,\"100% – 110%\",IF(D10=Text!C235,\"95% – 105%\",IF(D10=Text!C236,\"95% – 105%\",IF(D10=Text!C237,\"100% – 110%\",IF(D10=Text!C238,\"100% – 110%\",IF(D10=Text!C239,\"95% – 105%\",IF(D10=Text!C240,\"95% – 105%\",\"95% – 105\"))))))))","v":"95% – 105%"},{"$f":"Text!C224","v":"Ergebnis ≥ oder ≤ als Vergleichswert (Zielbereich)"},null,{"$f":"IF(D10=Text!C233,1,IF(D10=Text!C234,1,IF(D10=Text!C235,0.95,IF(D10=Text!C236,0.95,IF(D10=Text!C237,1,IF(D10=Text!C238,1,IF(D10=Text!C239,0.95,IF(D10=Text!C240,0.95,0.95))))))))","v":0.95},{"$f":"IF(D10=Text!C233,1.1,IF(D10=Text!C234,1.1,IF(D10=Text!C235,1.05,IF(D10=Text!C236,1.05,IF(D10=Text!C237,1.1,IF(D10=Text!C238,1.1,IF(D10=Text!C239,1.05,IF(D10=Text!C240,1.05,1.05))))))))","v":1.05}]
[null,"Situationserfassung V34"]
[{"$f":"Text!C45","v":"Eingabefelder"},{"$f":"Text!C30","v":"Empfohlene Dateiformate: .xlsm oder .xls (Excel 97-2004)"}]

{"sheet":"Bilder_DE","index":3,"n_rows":59,"n_cols":24,"rows_kept":59,"cut":false,"hidden":false,"merged":[[36,21,41,27],[43,21,48,27],[50,21,55,27],[22,21,27,27],[6,2,6,6],[10,21,11,26],[13,21,13,27],[15,21,20,27],[29,21,34,27]]}
[{"$f":"Verbraucher_Consommateurs!A3","v":"Projekt/Variante:"},null,{"$f":"IF(Verbraucher_Consommateurs!$B3=\"\",\"\",Verbraucher_Consommateurs!$B3)","v":"Musterbeispiel (Linie 1)"},null,null,null,null,{"$f":"A1","v":"Projekt/Variante:"},null,{"$f":"IF(Verbraucher_Consommateurs!$B3=\"\",\"\",Verbraucher_Consommateurs!$B3)","v":"Musterbeispiel (Linie 1)"},null,null,null,null,{"$f":"A1","v":"Projekt/Variante:"},null,{"$f":"IF(Verbraucher_Consommateurs!$B3=\"\",\"\",Verbraucher_Consommateurs!$B3)","v":"Musterbeispiel (Linie 1)"},null,null,null,null,{"$f":"A1","v":"Projekt/Variante:"},null,{"$f":"IF(Verbraucher_Consommateurs!$B3=\"\",\"\",Verbraucher_Consommateurs!$B3)","v":"Musterbeispiel (Linie 1)"}]
[null,null,{"$f":"IF(Verbraucher_Consommateurs!$B4=\"\",\"\",Verbraucher_Consommateurs!$B4)","v":"Musterbeispiel (Linie 2)"},null,null,null,null,null,null,{"$f":"IF(Verbraucher_Consommateurs!$B4=\"\",\"\",Verbraucher_Consommateurs!$B4)","v":"Musterbeispiel (Linie 2)"},null,null,null,null,null,null,{"$f":"IF(Verbraucher_Consommateurs!$B4=\"\",\"\",Verbraucher_Consommateurs!$B4)","v":"Musterbeispiel (Linie 2)"},null,null,null,null,null,null,{"$f":"IF(Verbraucher_Consommateurs!$B4=\"\",\"\",Verbraucher_Consommateurs!$B4)","v":"Musterbeispiel (Linie 2)"}]
[null,null,{"$f":"IF(Verbraucher_Consommateurs!$B5=\"\",\"\",Verbraucher_Consommateurs!$B5)","v":"Musterbeispiel (Linie 3)"},null,null,null,null,null,null,{"$f":"IF(Verbraucher_Consommateurs!$B5=\"\",\"\",Verbraucher_Consommateurs!$B5)","v":"Musterbeispiel (Linie 3)"},null,null,null,null,null,null,{"$f":"IF(Verbraucher_Consommateurs!$B5=\"\",\"\",Verbraucher_Consommateurs!$B5)","v":"Musterbeispiel (Linie 3)"},null,null,null,null,null,null,{"$f":"IF(Verbraucher_Consommateurs!$B5=\"\",\"\",Verbraucher_Consommateurs!$B5)","v":"Musterbeispiel (Linie 3)"}]
[{"$f":"Verbraucher_Consommateurs!A6","v":"Erfasst von:"},null,{"$f":"IF(Verbraucher_Consommateurs!$B6=\"\",\"\",Verbraucher_Consommateurs!$B6)","v":"Musterplaner"},null,null,null,null,{"$f":"A4","v":"Erfasst von:"},null,{"$f":"IF(Verbraucher_Consommateurs!$B6=\"\",\"\",Verbraucher_Consommateurs!$B6)","v":"Musterplaner"},null,null,null,null,{"$f":"A4","v":"Erfasst von:"},null,{"$f":"IF(Verbraucher_Consommateurs!$B6=\"\",\"\",Verbraucher_Consommateurs!$B6)","v":"Musterplaner"},null,null,null,null,{"$f":"A4","v":"Erfasst von:"},null,{"$f":"IF(Verbraucher_Consommateurs!$B6=\"\",\"\",Verbraucher_Consommateurs!$B6)","v":"Musterplaner"}]
[{"$f":"Verbraucher_Consommateurs!A7","v":"Datum:"},null,{"$f":"IF(Verbraucher_Consommateurs!$B7=\"\",\"\",Verbraucher_Consommateurs!$B7)","v":"2014-05-02"},null,null,null,null,{"$f":"A5","v":"Datum:"},null,{"$f":"IF(Verbraucher_Consommateurs!$B7=\"\",\"\",Verbraucher_Consommateurs!$B7)","v":"2014-05-02"},null,null,null,null,{"$f":"A5","v":"Datum:"},null,{"$f":"IF(Verbraucher_Consommateurs!$B7=\"\",\"\",Verbraucher_Consommateurs!$B7)","v":"2014-05-02"},null,null,null,null,{"$f":"A5","v":"Datum:"},null,{"$f":"IF(Verbraucher_Consommateurs!$B7=\"\",\"\",Verbraucher_Consommateurs!$B7)","v":"2014-05-02"}]
["Klimastation:",null,{"$f":"Hilfsblatt!G29","v":"Zürich/Fluntern (CH), 556 m ü. M."},null,null,null,null,{"$f":"A6","v":"Klimastation:"},null,{"$f":"C6","v":"Zürich/Fluntern (CH), 556 m ü. M."},null,null,"Vorgabe:","Effektiv:",{"$f":"A6","v":"Klimastation:"},null,{"$f":"C6","v":"Zürich/Fluntern (CH), 556 m ü. M."},null,null,{"$f":"M6","v":"Vorgabe:"},"Effektiv:",{"$f":"A6","v":"Klimastation:"},{"$f":"Hilfsblatt!AK1","v":0},{"$f":"C6","v":"Zürich/Fluntern (CH), 556 m ü. M."}]
[null,null,null,null,null,null,null,null,null,null,null,"Min. mittlere Holzkessel-Tagesleistung  [kW]:",{"$f":"Wärmezentrale_CentraleThermique!D20*Wärmezentrale_CentraleThermique!D11","v":135},{"$f":"Hilfsblatt!AG29","v":175},null,null,null,null,{"$f":"L7","v":"Min. mittlere Holzkessel-Tagesleistung  [kW]:"},135,175]
[{"$f":"Verbraucher_Consommateurs!B42","v":"Situationserfassung V35"},null,null,null,null,null,null,null,null,null,null,"Max. mittlere Holzkessel-Tagesleistung  [kW]:",{"$f":"Wärmezentrale_CentraleThermique!D21*Wärmezentrale_CentraleThermique!D15","v":810},{"$f":"Hilfsblatt!AG31","v":804},null,null,null,null,{"$f":"L8","v":"Max. mittlere Holzkessel-Tagesleistung  [kW]:"},810,804]
[null,null,null,null,null,null,null,null,null,null,null,"Max. mittlere Bandquellen-Tagesleist. [kW]:",{"$f":"Wärmezentrale_CentraleThermique!D22","v":0},{"$f":"Hilfsblatt!Y31","v":0},null,null,null,null,{"$f":"L9","v":"Max. mittlere Bandquellen-Tagesleist. [kW]:"},{"$f":"M9","v":0},{"$f":"N9","v":0}]
[]
[null,null,null,null,null,null,null,null,null,null,null,null,null,null,null,null,null,null,null,null,null,"Bemerkungen zur Situationserfassung"]
[]
[]
[null,null,null,null,null,null,null,null,null,null,null,null,null,null,null,null,null,null,null,null,null,{"$f":"IF(W6=6,\"Abweichende Resultate sind vom Planer zu kommentieren!\",\"\")","v":""}]
[null,null,null,null,null,null,null,null,null,null,null,null,null,null,null,null,null,null,null,null,null,"Diagramm Seite 1 oben:"]
[]
[]
[]
[]
[]
[]
[null,null,null,null,null,null,null,null,null,null,null,null,null,null,null,null,null,null,null,null,null,"Diagramm Seite 1 unten:"]
[]
[]
[]
[]
[]
[]
[null,null,null,null,null,null,null,null,null,null,null,null,null,null,null,null,null,null,null,null,null,"Diagramm Seite 2 oben:"]
[]
[]
[]
[]
[]
[]
[]
[]
[]
[]
[]
[]
[]
[]
[]
[]
[]
[]
[]
[]
[]
[]
[]
[]
[]
[null,null,null,null,null,null,{"$f":"Verbraucher_Consommateurs!B42","v":"Situationserfassung V35"},null,null,null,null,null,null,{"$f":"Verbraucher_Consommateurs!B42","v":"Situationserfassung V35"},null,null,null,null,null,null,{"$f":"Verbraucher_Consommateurs!B42","v":"Situationserfassung V35"}]
["Diagramm oben: ","Ausgezogen die Lastkennlinie der Gesamtanlage; gestrichelt die Lastkennlinie zur Berechnung",null,null,null,null,null,{"$f":"A56","v":"Diagramm oben: "},"Jahresdauerlinie der benötigten Wärmeleistung mit umrahmten Holzkessel- und Bandleistungs-",null,null,null,null,null,{"$f":"H56","v":"Diagramm oben: "},"Gesamt-Wärmeproduktion und Produktionsanteile des Holzkessels und der Bandleistungs-"]
[null,"der Jahresdauerlinie der benötigten Wärmeleistung",null,null,null,null,null,null,"Anteilen",null,null,null,null,null,null,"quelle"]
[null,null,null,null,null,null,null,{"$f":"A59","v":"Diagramm unten: "},"Jahresdauerlinien der Aussentemperatur",null,null,null,null,null,{"$f":"H58","v":"Diagramm unten: "},"Gesamt-Wärmeproduktion und Produktionsanteile des Holzkessels und der Bandleistungs-"]
["Diagramm unten: ","Vergleich Gesamt-Wärmebedarf",null,null,null,null,null,null,null,null,null,null,null,null,null,"quelle in Prozent der Gesamtproduktion"]

{"sheet":"Figures_FR","index":4,"n_rows":60,"n_cols":24,"rows_kept":60,"cut":false,"hidden":false,"merged":[[36,21,41,27],[43,21,48,27],[50,21,55,27],[6,2,6,6],[10,21,11,26],[15,21,20,27],[22,21,27,27],[29,21,34,27]]}
[{"$f":"Verbraucher_Consommateurs!A3","v":"Projekt/Variante:"},null,{"$f":"IF(Verbraucher_Consommateurs!$B3=\"\",\"\",Verbraucher_Consommateurs!$B3)","v":"Musterbeispiel (Linie 1)"},null,null,null,null,{"$f":"A1","v":"Projekt/Variante:"},null,{"$f":"IF(Verbraucher_Consommateurs!$B3=\"\",\"\",Verbraucher_Consommateurs!$B3)","v":"Musterbeispiel (Linie 1)"},null,null,null,null,{"$f":"A1","v":"Projekt/Variante:"},null,{"$f":"IF(Verbraucher_Consommateurs!$B3=\"\",\"\",Verbraucher_Consommateurs!$B3)","v":"Musterbeispiel (Linie 1)"},null,null,null,null,{"$f":"A1","v":"Projekt/Variante:"},null,{"$f":"IF(Verbraucher_Consommateurs!$B3=\"\",\"\",Verbraucher_Consommateurs!$B3)","v":"Musterbeispiel (Linie 1)"}]
[null,null,{"$f":"IF(Verbraucher_Consommateurs!$B4=\"\",\"\",Verbraucher_Consommateurs!$B4)","v":"Musterbeispiel (Linie 2)"},null,null,null,null,null,null,{"$f":"IF(Verbraucher_Consommateurs!$B4=\"\",\"\",Verbraucher_Consommateurs!$B4)","v":"Musterbeispiel (Linie 2)"},null,null,null,null,null,null,{"$f":"IF(Verbraucher_Consommateurs!$B4=\"\",\"\",Verbraucher_Consommateurs!$B4)","v":"Musterbeispiel (Linie 2)"},null,null,null,null,null,null,{"$f":"IF(Verbraucher_Consommateurs!$B4=\"\",\"\",Verbraucher_Consommateurs!$B4)","v":"Musterbeispiel (Linie 2)"}]
[null,null,{"$f":"IF(Verbraucher_Consommateurs!$B5=\"\",\"\",Verbraucher_Consommateurs!$B5)","v":"Musterbeispiel (Linie 3)"},null,null,null,null,null,null,{"$f":"IF(Verbraucher_Consommateurs!$B5=\"\",\"\",Verbraucher_Consommateurs!$B5)","v":"Musterbeispiel (Linie 3)"},null,null,null,null,null,null,{"$f":"IF(Verbraucher_Consommateurs!$B5=\"\",\"\",Verbraucher_Consommateurs!$B5)","v":"Musterbeispiel (Linie 3)"},null,null,null,null,null,null,{"$f":"IF(Verbraucher_Consommateurs!$B5=\"\",\"\",Verbraucher_Consommateurs!$B5)","v":"Musterbeispiel (Linie 3)"}]
[{"$f":"Verbraucher_Consommateurs!A6","v":"Erfasst von:"},null,{"$f":"IF(Verbraucher_Consommateurs!$B6=\"\",\"\",Verbraucher_Consommateurs!$B6)","v":"Musterplaner"},null,null,null,null,{"$f":"A4","v":"Erfasst von:"},null,{"$f":"IF(Verbraucher_Consommateurs!$B6=\"\",\"\",Verbraucher_Consommateurs!$B6)","v":"Musterplaner"},null,null,null,null,{"$f":"A4","v":"Erfasst von:"},null,{"$f":"IF(Verbraucher_Consommateurs!$B6=\"\",\"\",Verbraucher_Consommateurs!$B6)","v":"Musterplaner"},null,null,null,null,{"$f":"A4","v":"Erfasst von:"},null,{"$f":"IF(Verbraucher_Consommateurs!$B6=\"\",\"\",Verbraucher_Consommateurs!$B6)","v":"Musterplaner"}]
[{"$f":"Verbraucher_Consommateurs!A7","v":"Datum:"},null,{"$f":"IF(Verbraucher_Consommateurs!$B7=\"\",\"\",Verbraucher_Consommateurs!$B7)","v":"2014-05-02"},null,null,null,null,{"$f":"A5","v":"Datum:"},null,{"$f":"IF(Verbraucher_Consommateurs!$B7=\"\",\"\",Verbraucher_Consommateurs!$B7)","v":"2014-05-02"},null,null,null,null,{"$f":"A5","v":"Datum:"},null,{"$f":"IF(Verbraucher_Consommateurs!$B7=\"\",\"\",Verbraucher_Consommateurs!$B7)","v":"2014-05-02"},null,null,null,null,{"$f":"A5","v":"Datum:"},null,{"$f":"IF(Verbraucher_Consommateurs!$B7=\"\",\"\",Verbraucher_Consommateurs!$B7)","v":"2014-05-02"}]
["Station climatologique:",null,{"$f":"Hilfsblatt!G29","v":"Zürich/Fluntern (CH), 556 m ü. M."},null,null,null,null,{"$f":"A6","v":"Station climatologique:"},null,{"$f":"C6","v":"Zürich/Fluntern (CH), 556 m ü. M."},null,null,"Spécification:","Effectif:",{"$f":"A6","v":"Station climatologique:"},null,{"$f":"C6","v":"Zürich/Fluntern (CH), 556 m ü. M."},null,null,{"$f":"M6","v":"Spécification:"},"Effectif:",{"$f":"A6","v":"Station climatologique:"},null,{"$f":"C6","v":"Zürich/Fluntern (CH), 556 m ü. M."}]
[null,null,null,null,null,null,null,null,null,null,null,"Performance journalière moyenne minimale de la chaudière à bois  [kW]:",{"$f":"Wärmezentrale_CentraleThermique!D20*Wärmezentrale_CentraleThermique!D11","v":135},{"$f":"Hilfsblatt!AG29","v":175},null,null,null,null,{"$f":"L7","v":"Performance journalière moyenne minimale de la chaudière à bois  [kW]:"},135,175]
[{"$f":"Verbraucher_Consommateurs!B42","v":"Situationserfassung V35"},null,null,null,null,null,null,null,null,null,null,"Performance journalière moyenne maximale de la chaudière à bois  [kW]:",{"$f":"Wärmezentrale_CentraleThermique!D21*Wärmezentrale_CentraleThermique!D15","v":810},{"$f":"Hilfsblatt!AG31","v":804},null,null,null,null,{"$f":"L8","v":"Performance journalière moyenne maximale de la chaudière à bois  [kW]:"},810,804]
[null,null,null,null,null,null,null,null,null,null,null,"Performance journalière moyenne maximale de la source de puissance de base [kW]:",{"$f":"Wärmezentrale_CentraleThermique!D22","v":0},{"$f":"Hilfsblatt!Y31","v":0},null,null,null,null,{"$f":"L9","v":"Performance journalière moyenne maximale de la source de puissance de base [kW]:"},{"$f":"M9","v":0},{"$f":"N9","v":0}]
[]
[null,null,null,null,null,null,null,null,null,null,null,null,null,null,null,null,null,null,null,null,null,"Remarques sur le relevé de situation"]
[]
[]
[]
[null,null,null,null,null,null,null,null,null,null,null,null,null,null,null,null,null,null,null,null,null,"Graphique Page 1 ci-dessus:"]
[]
[]
[]
[]
[]
[]
[null,null,null,null,null,null,null,null,null,null,null,null,null,null,null,null,null,null,null,null,null,"Graphique Page 1 ci-dessous:"]
[]
[]
[]
[]
[]
[]
[null,null,null,null,null,null,null,null,null,null,null,null,null,null,null,null,null,null,null,null,null,"Graphique Page 2 ci-dessus:"]
[]
[]
[]
[]
[]
[]
[]
[]
[]
[]
[]
[]
[]
[]
[]
[]
[]
[]
[]
[]
[]
[]
[]
[]
[]
[null,null,null,null,null,null,{"$f":"Verbraucher_Consommateurs!B42","v":"Situationserfassung V35"},null,null,null,null,null,null,{"$f":"Verbraucher_Consommateurs!B42","v":"Situationserfassung V35"},null,null,null,null,null,null,{"$f":"Verbraucher_Consommateurs!B42","v":"Situationserfassung V35"}]
["Diagramme en haut: ","Dessinée en continu, la courbe  caractéristique de charge ensemble de l'installation; en traits",null,null,null,null,null,{"$f":"A56","v":"Diagramme en haut: "},"Courbe de distribution annuelle de la puissance thermique à installer avec les parts des",null,null,null,null,null,{"$f":"H56","v":"Diagramme en haut: "},"Production de chaleur globale et parts de production des chaudières à bois et de la source"]
[null,"discontinus, la courbe caractéristique de charge pondérée pour le calcul de la courbe de",null,null,null,null,null,null,"chaudières à bois et de la source de puissance de base encadrées.",null,null,null,null,null,null,"de puissance de base."]
[null,"distribution annuelle de la puissance thermique nécessaire.",null,null,null,null,null,{"$f":"A60","v":"Diagramme en bas: "},"Courbes de distribution annuelle de la température extérieure. ",null,null,null,null,null,{"$f":"H58","v":"Diagramme en bas: "},"Production de chaleur globale et parts de production des chaudières à bois et de la source "]
[null,null,null,null,null,null,null,null,null,null,null,null,null,null,null,"de puissance de base, en pourcentage de la production totale."]
["Diagramme en bas: ","Comparaison des besoins totaux de chaleur."]

{"sheet":"Bilder_IT","index":5,"n_rows":58,"n_cols":24,"rows_kept":58,"cut":false,"hidden":true,"merged":[[35,21,40,27],[42,21,47,27],[49,21,54,27],[5,2,5,6],[9,21,10,26],[14,21,19,27],[21,21,26,27],[28,21,33,27]]}
[{"$f":"Verbraucher_Consommateurs!A3","v":"Projekt/Variante:"},null,{"$f":"IF(Verbraucher_Consommateurs!$B3=\"\",\"\",Verbraucher_Consommateurs!$B3)","v":"Musterbeispiel (Linie 1)"},null,null,null,null,{"$f":"A1","v":"Projekt/Variante:"},null,{"$f":"IF(Verbraucher_Consommateurs!$B3=\"\",\"\",Verbraucher_Consommateurs!$B3)","v":"Musterbeispiel (Linie 1)"},null,null,null,null,{"$f":"A1","v":"Projekt/Variante:"},null,{"$f":"IF(Verbraucher_Consommateurs!$B3=\"\",\"\",Verbraucher_Consommateurs!$B3)","v":"Musterbeispiel (Linie 1)"},null,null,null,null,{"$f":"A1","v":"Projekt/Variante:"},null,{"$f":"IF(Verbraucher_Consommateurs!$B3=\"\",\"\",Verbraucher_Consommateurs!$B3)","v":"Musterbeispiel (Linie 1)"}]
[null,null,{"$f":"IF(Verbraucher_Consommateurs!$B4=\"\",\"\",Verbraucher_Consommateurs!$B4)","v":"Musterbeispiel (Linie 2)"},null,null,null,null,null,null,{"$f":"IF(Verbraucher_Consommateurs!$B4=\"\",\"\",Verbraucher_Consommateurs!$B4)","v":"Musterbeispiel (Linie 2)"},null,null,null,null,null,null,{"$f":"IF(Verbraucher_Consommateurs!$B4=\"\",\"\",Verbraucher_Consommateurs!$B4)","v":"Musterbeispiel (Linie 2)"},null,null,null,null,null,null,{"$f":"IF(Verbraucher_Consommateurs!$B4=\"\",\"\",Verbraucher_Consommateurs!$B4)","v":"Musterbeispiel (Linie 2)"}]
[null,null,{"$f":"IF(Verbraucher_Consommateurs!$B5=\"\",\"\",Verbraucher_Consommateurs!$B5)","v":"Musterbeispiel (Linie 3)"},null,null,null,null,null,null,{"$f":"IF(Verbraucher_Consommateurs!$B5=\"\",\"\",Verbraucher_Consommateurs!$B5)","v":"Musterbeispiel (Linie 3)"},null,null,null,null,null,null,{"$f":"IF(Verbraucher_Consommateurs!$B5=\"\",\"\",Verbraucher_Consommateurs!$B5)","v":"Musterbeispiel (Linie 3)"},null,null,null,null,null,null,{"$f":"IF(Verbraucher_Consommateurs!$B5=\"\",\"\",Verbraucher_Consommateurs!$B5)","v":"Musterbeispiel (Linie 3)"}]
[{"$f":"Verbraucher_Consommateurs!A6","v":"Erfasst von:"},null,{"$f":"IF(Verbraucher_Consommateurs!$B6=\"\",\"\",Verbraucher_Consommateurs!$B6)","v":"Musterplaner"},null,null,null,null,{"$f":"A4","v":"Erfasst von:"},null,{"$f":"IF(Verbraucher_Consommateurs!$B6=\"\",\"\",Verbraucher_Consommateurs!$B6)","v":"Musterplaner"},null,null,null,null,{"$f":"A4","v":"Erfasst von:"},null,{"$f":"IF(Verbraucher_Consommateurs!$B6=\"\",\"\",Verbraucher_Consommateurs!$B6)","v":"Musterplaner"},null,null,null,null,{"$f":"A4","v":"Erfasst von:"},null,{"$f":"IF(Verbraucher_Consommateurs!$B6=\"\",\"\",Verbraucher_Consommateurs!$B6)","v":"Musterplaner"}]
["Klimastation:",null,{"$f":"Hilfsblatt!G29","v":"Zürich/Fluntern (CH), 556 m ü. M."},null,null,null,null,{"$f":"A5","v":"Klimastation:"},null,{"$f":"C5","v":"Zürich/Fluntern (CH), 556 m ü. M."},null,null,"Vorgabe:","Effektiv:",{"$f":"A5","v":"Klimastation:"},null,{"$f":"C5","v":"Zürich/Fluntern (CH), 556 m ü. M."},null,null,{"$f":"M5","v":"Vorgabe:"},"Effektiv:",{"$f":"A5","v":"Klimastation:"},null,{"$f":"C5","v":"Zürich/Fluntern (CH), 556 m ü. M."}]
[null,null,{"$f":"IF(Hilfsblatt!T2=2,\"Données seulement actives dans la feuille 'Figures_FR'\",IF(Hilfsblatt!T2=1,\"Eingaben sind nur im Blatt Bilder_DE aktiv!\",\"\"))","v":"Eingaben sind nur im Blatt Bilder_DE aktiv!"},null,null,null,null,null,null,null,null,"Min. mittlere Holzkessel-Tagesleistung  [kW]:",150,{"$f":"Hilfsblatt!AG29","v":175},null,null,null,null,{"$f":"L6","v":"Min. mittlere Holzkessel-Tagesleistung  [kW]:"},150,175]
[null,null,null,null,null,null,null,null,null,null,null,"Max. mittlere Holzkessel-Tagesleistung  [kW]:",500,{"$f":"Hilfsblatt!AG31","v":804},null,null,null,null,{"$f":"L7","v":"Max. mittlere Holzkessel-Tagesleistung  [kW]:"},500,804]
[null,null,null,null,null,null,null,null,null,null,null,"Max. mittlere Bandquellen-Tagesleist. [kW]:",100,{"$f":"Hilfsblatt!Y31","v":0},null,null,null,null,{"$f":"L8","v":"Max. mittlere Bandquellen-Tagesleist. [kW]:"},{"$f":"M8","v":100},{"$f":"N8","v":0}]
[]
[null,null,null,null,null,null,null,null,null,null,null,null,null,null,null,null,null,null,null,null,null,"Bemerkungen zur Situationserfassung"]
[]
[]
[]
[]
[]
[]
[]
[]
[]
[]
[]
[]
[]
[]
[]
[]
[]
[]
[]
[]
[]
[]
[]
[]
[]
[]
[]
[]
[]
[]
[]
[]
[]
[]
[]
[]
[]
[]
[]
[]
[]
[]
[]
[]
["Diagramm oben: ","Ausgezogen die Lastkennlinie der Gesamtanlage; gestrichelt die Lastkennlinie zur Berechnung",null,null,null,null,null,{"$f":"A55","v":"Diagramm oben: "},"Jahresdauerlinie der benötigten Wärmeleistung und umrahmtem Holzkessel-Anteil",null,null,null,null,null,{"$f":"H55","v":"Diagramm oben: "},"Gesamt-Wärmeproduktion und Produktionsanteil des Holzkessels"]
[null,"der Jahresdauerlinie der benötigten Wärmeleistung"]
[null,null,null,null,null,null,null,{"$f":"A58","v":"Diagramm unten: "},"Jahresdauerlinien der Aussentemperatur",null,null,null,null,null,{"$f":"H57","v":"Diagramm unten: "},"Gesamt-Wärmeproduktion und Produktionsanteil des Holzkessels in Prozent der "]
["Diagramm unten: ","Vergleich Gesamt-Wärmebedarf",null,null,null,null,null,null,null,null,null,null,null,null,null,"Gesamtproduktion"]

{"sheet":"Text","index":6,"n_rows":251,"n_cols":6,"rows_kept":251,"cut":false,"hidden":true,"merged":[]}
["Blatt","Zelle",{"$f":"Hilfsblatt!T1","v":"DE"},"Deutsch","Französisch","Italienisch"]
[1,"A1",{"$f":"IF(C$1=\"FR\",E2,IF(C$1=\"IT\",F2,D2))","v":"QM Holzheizwerke"},"QM Holzheizwerke","QM Chauffages au bois","QM Holzheizwerke"]
[1,"A3",{"$f":"IF(C$1=\"FR\",E3,IF(C$1=\"IT\",F3,D3))","v":"Projekt/Variante:"},"Projekt/Variante:","Projet/Variante:","Projekt/Variante:"]
[1,"A6","Erfasst von:","Erfasst von:","Saisi par: ","Erfasser:"]
[1,"B3","Musterbeispiel (Linie 1)","Musterbeispiel (Linie 1)","Exemple modèle (ligne 1)","Musterbeispiel (Linie 1)"]
[1,"B4","Musterbeispiel (Linie 2)","Musterbeispiel (Linie 2)","Exemple modèle (ligne 2)","Musterbeispiel (Linie 2)"]
[1,"B5","Musterbeispiel (Linie 3)","Musterbeispiel (Linie 3)","Exemple modèle (ligne 3)","Musterbeispiel (Linie 3)"]
[1,"B6","Musterplaner","Musterplaner","Concepteur modèle","Musterplaner"]
[1,"A8","Eingaben Hauptplaner","Eingaben Hauptplaner","Données planificateur principale","Eingaben Hauptplaner"]
[1,"A10","Allgemeines","Allgemeines","Généralités","Allgemeines"]
[1,"B10","Nummer","Nummer","Numéro","Nummer"]
[1,"B11","Bezeichnung","Bezeichnung","Indication","Bezeichnung"]
[1,"B12","Sprache:","Sprache:","langue"," "]
[1,"B13","Datum:","Datum:","Date:"," "]
[1,"B14","Wärmebedarfsermittlung anhand","Wärmebedarfsermittlung anhand","Détermination du besoin de chaleur au moyen de","Wärmebedarfsermittlung anhand"]
[1,"B15","Energiebezugsfläche [m²]","Energiebezugsfläche [m²]","Surface de référence énergétique [m²]","Energiebezugsfläche [m²]"]
[1,"B16","Max. Vorlauftemperatur [°C]","Max. Vorlauftemperatur [°C]","Température aller max. [°C]","Max. Vorlauftemperatur [°C]"]
[1,"B17","Max. Rücklauftemperatur [°C]","Max. Rücklauftemperatur [°C]","Température retour max. [°C]","Max. Rücklauftemperatur [°C]"]
[1,"A18","Raumwärme","Raumwärme","Chaleur ambiante","Raumwärme"]
[1,"B18","Heizwärmebedarf [MWh/a]","Heizwärmebedarf [MWh/a]","Besoin de chaleur [MWh/a]","Heizwärmebedarf [MWh/a]"]
[1,"B19","Max. Wärmeleistungsbedarf Raumwärme [kW]","Max. Wärmeleistungsbedarf Raumwärme [kW]","Puissance thermique requise chaleur ambiante  max. [kW]","Max. Wärmeleistungsbedarf Raumwärme [kW]"]
[1,"B20","Korrekturfaktor Heizwärmebedarf [-]","Korrekturfaktor Heizwärmebedarf [-]","Facteur de correction besoin de chaleur [-]","Korrekturfaktor Heizwärmebedarf [-]"]
[1,"B21","Korrekturfaktor Aufheizspitze [-]","Korrekturfaktor Aufheizspitze [-]","Facteur de correction pointe de préchauffage [-]","Korrekturfaktor Aufheizspitze [-]"]
[1,"A22","Warmwasser","Warmwasser","Eau chaude","Warmwasser"]
[1,"B22","Jahreswärmebedarf Warmwasser [MWh/a]*","Jahreswärmebedarf Warmwasser [MWh/a]*","Besoin de chaleur annuel eau chaude [MWh/a]*","Jahreswärmebedarf Warmwasser [MWh/a]*"]
[1,"B23","Max. Wärmeleistungsbedarf Warmwasser [kW]","Max. Wärmeleistungsbedarf Warmwasser [kW]","Puissance thermique requise eau chaude max. [kW]","Max. Wärmeleistungsbedarf Warmwasser [kW]"]
[1,"A24","Prozesswärme","Prozesswärme","Chaleur industrielle","Prozesswärme"]
[1,"B24","Jahreswärmebedarf Prozesswärme [MWh/a]*","Jahreswärmebedarf Prozesswärme [MWh/a]*","Besoins de chaleur annuel chaleur industrielle [MWh/a]*","Jahreswärmebedarf Prozesswärme [MWh/a]*"]
[1,"B25","Max. Wärmeleistungsbedarf Prozesswärme [kW]","Max. Wärmeleistungsbedarf Prozesswärme [kW]","Puissance thermique requise chaleur industrielle max. [kW]","Max. Wärmeleistungsbedarf Prozesswärme [kW]"]
[1,"B41","Empfohlene Dateiformate: .xlsm oder .xls (Excel 97-2004)","Empfohlene Dateiformate: .xlsm oder .xls (Excel 97-2004)","Formats de fichiers recommandés: .xlsm oder .xls (Excel 97-2004)","Formati di file consigliati: .xlsm oder .xls (Excel 97-2004)"]
[1,"A28","Berechnete Kennzahlen","Berechnete Kennzahlen","Données caractéristiques calculées","Berechnete Kennzahlen"]
[1,"A30","Raumwärme","Raumwärme","Chaleur ambiante","Raumwärme"]
[1,"B30","Vollbetriebsstundenzahl Raumwärme [h/a]","Vollbetriebsstundenzahl Raumwärme [h/a]","Heures de marche à pleine charge chaleur ambiante [h/a]","Vollbetriebsstundenzahl Raumwärme [h/a]"]
[1,"B31","Spezifischer Heizwärmebedarf [kWh/m²a]","Spezifischer Heizwärmebedarf [kWh/m²a]","Besoin de chaleur spécifique [kWh/m²a]","Spezifischer Heizwärmebedarf [kWh/m²a]"]
[1,"B32","Spezifischer Wärmeleistungsbedarf [W/m²]","Spezifischer Wärmeleistungsbedarf [W/m²]","Puissance thermique spécifique requise [W/m²]","Spezifischer Wärmeleistungsbedarf [W/m²]"]
[1,"A33","Warmwasser","Warmwasser","Eau chaude","Warmwasser"]
[1,"B33","Vollbetriebsstundenzahl Warmwasser [h/a]","Vollbetriebsstundenzahl Warmwasser [h/a]","Heures de marche à pleine charge eau chaude [h/a]","Vollbetriebsstundenzahl Warmwasser [h/a]"]
[1,"B34","Spezifischer Energiebedarf Warmwasser [kWh/m²a]","Spezifischer Energiebedarf Warmwasser [kWh/m²a]","Besoin d'énergie spécifique eau chaude [kWh/m²a]","Spezifischer Energiebedarf Warmwasser [kWh/m²a]"]
[1,"A35","Prozesswärme","Prozesswärme","Chaleur industrielle","Prozesswärme"]
[1,"B35","Vollbetriebsstundenzahl Prozesswärme [h/a]","Vollbetriebsstundenzahl Prozesswärme [h/a]","Heures de marche à pleine charge chaleur industrielle [h/a]","Vollbetriebsstundenzahl Prozesswärme [h/a]"]
[1,null," "," "," "," "]
[1,"A37","* Es ist der Jahreswärmebedarf für 365 Tage einzugeben ","* Es ist der Jahreswärmebedarf für 365 Tage einzugeben ","* Le besoin de chaleur annuel pour 365 jours doit être indiqué","* Es ist der Jahreswärmebedarf für 365 Tage einzugeben "]
[1,"A38","(Winter-Wärmebedarf = Jahreswärmebedarf x Heiztage / 365 Tage)","(Winter-Wärmebedarf = Jahreswärmebedarf x Heiztage / 365 Tage)","(besoin de chaleur hiver = besoin de chaleur annuel x jours chauffées / 365 jours)","(Winter-Wärmebedarf = Jahreswärmebedarf x Heiztage / 365 Tage)"]
[1,null," "," "," "," "]
[1,"A40","Eingabefelder","Eingabefelder","Champs a remplir","Eingabefelder"]
[null,null," "," "," "," "]
[2,"A8","Eingaben Hauptplaner","Eingaben Hauptplaner","Données planificateur principale","Eingaben Hauptplaner"]
[2,"A10","Allgemeines","Allgemeines","Généralités","Allgemeines"]
[2,"B10","Land","Land","Pays","Land"]
[2,"B11","Klimastation","Klimastation","Station climatologique","Klimastation"]
[2,"B12","Tiefste Aussentemperatur [°C]","Tiefste Aussentemperatur [°C]","Température extérieure plus basse [°C]","Tiefste Aussentemperatur [°C]"]
[2,"E12","°C = 10-Jahres-Mittelwert (2002 - 2011)","°C = 10-Jahres-Mittelwert (2002 - 2011)","°C = valeur moyenne 10 ans (2002 - 2011)","°C = 10-Jahres-Mittelwert (2002 - 2011)"]
[2,"B13","Raumtemperatur [°C]","Raumtemperatur [°C]","Température ambiante [°C]","Raumtemperatur [°C]"]
[2,"B14","Heizgrenze [°C]","Heizgrenze [°C]","Limite de chauffage [°C]","Heizgrenze [°C]"]
[2,"B15","Max. Haupt-Vorlauftemperatur [°C]","Max. Haupt-Vorlauftemperatur [°C]","Température aller principale max. [°C]","Max. Haupt-Vorlauftemperatur [°C]"]
[2,"B16","Sommerbetrieb","Sommerbetrieb","Exploitation estivale","Sommerbetrieb"]
[2,"A17","Raumwärme","Raumwärme","Chaleur ambiante","Raumwärme"]
[2,"B17","Nicht witterungsabhängiger Anteil Wärmeleistungsbedarf Raumwärme [%]","Nicht witterungsabhängiger Anteil Wärmeleistungsbedarf Raumwärme [%]","Part de la puissance thermique requise chaleur ambiante non dépendante de la température extérieure [%]","Nicht witterungsabhängiger Anteil Wärmeleistungsbedarf Raumwärme [%]"]
[2,"B18","Gleichzeitigkeitsfaktor Raumwärme [-]","Gleichzeitigkeitsfaktor Raumwärme [-]","Facteur de simultanéité chaleur ambiante [-]","Gleichzeitigkeitsfaktor Raumwärme [-]"]
[2,"A19","Warmwasser","Warmwasser","Eau chaude","Warmwasser"]
[2,"B19","Gleichzeitigkeitsfaktor Warmwasser [-]","Gleichzeitigkeitsfaktor Warmwasser [-]","Facteur de simultanéité eau chaude [-]","Gleichzeitigkeitsfaktor Warmwasser [-]"]
[2,"A20","Prozesswärme","Prozesswärme","Chaleur industrielle","Prozesswärme"]
[2,"B20","Gleichzeitigkeitsfaktor Prozesswärme [-]","Gleichzeitigkeitsfaktor Prozesswärme [-]","Facteur de simultanéité chaleur industrielle [-]","Gleichzeitigkeitsfaktor Prozesswärme [-]"]
[2,"A21","Fernleitung","Fernleitung","Conduite à distance","Fernleitung"]
[2,"B21","Jahres-Wärmeverlust Fernleitung [MWh/a]","Jahres-Wärmeverlust Fernleitung [MWh/a]","Perte de chaleur annuelle conduite à distance [MWh/a]","Jahres-Wärmeverlust Fernleitung [MWh/a]"]
[2,"B22","Verlustleistung Fernleitung [kW]","Verlustleistung Fernleitung [kW]","Perte de puissance conduite à distance [kW]","Verlustleistung Fernleitung [kW]"]
[2,null,{"$f":"IF(C$1=\"FR\",E67,IF(C$1=\"IT\",F67,D67))","v":" "}," "," "," "]
[2,"A24","Berechnete Summenwerte","Berechnete Summenwerte","Valeurs cumulées calculées","Berechnete Summenwerte"]
[2,"A26","Allgemeines","Allgemeines","Généralités","Allgemeines"]
[2,"B26","Gesamt-Energiebezugsfläche [m²]","Gesamt-Energiebezugsfläche [m²]","Surface de référence énergétique totale [m²]","Gesamt-Energiebezugsfläche [m²]"]
[2,"A27","Raumwärme","Raumwärme","Chaleur ambiante","Raumwärme"]
[2,"B27","Gesamt-Heizwärmebdarf [MWh/a]","Gesamt-Heizwärmebdarf [MWh/a]","Besoin de chaleur total [MWh/a]","Gesamt-Heizwärmebdarf [MWh/a]"]
[2,"B28","Max. Gesamt-Wärmeleistungsbedarf Raumwärme [kW]","Max. Gesamt-Wärmeleistungsbedarf Raumwärme [kW]","Puissance thermique totale requise chaleur ambiante max. [kW]","Max. Gesamt-Wärmeleistungsbedarf Raumwärme [kW]"]
[2,"A29","Warmwasser","Warmwasser","Eau chaude","Warmwasser"]
[2,"B29","Gesamt-Jahreswärmebdarf Warmwasser [MWh/a]","Gesamt-Jahreswärmebdarf Warmwasser [MWh/a]","Besoin de chaleur annuel total eau chaude [MWh/a]","Gesamt-Jahreswärmebdarf Warmwasser [MWh/a]"]
[2,"B30","Max. Gesamt-Wärmeleistungsbedarf Warmwasser [kW]","Max. Gesamt-Wärmeleistungsbedarf Warmwasser [kW]","Puissance thermique totale requise eau chaude max. [kW]","Max. Gesamt-Wärmeleistungsbedarf Warmwasser [kW]"]
[2,"A31","Prozesswärme","Prozesswärme","Chaleur industrielle","Prozesswärme"]
[2,"B31","Gesamt-Jahreswärmebdarf Prozesswärme [MWh/a]","Gesamt-Jahreswärmebdarf Prozesswärme [MWh/a]","Besoin de chaleur annuel total chaleur industrielle [MWh/a]","Gesamt-Jahreswärmebdarf Prozesswärme [MWh/a]"]
[2,"B32","Max. Gesamt-Wärmeleistungsbedarf Prozesswärme [kW]","Max. Gesamt-Wärmeleistungsbedarf Prozesswärme [kW]","Puissance thermique totale requise chaleur industrielle max. [kW]","Max. Gesamt-Wärmeleistungsbedarf Prozesswärme [kW]"]
[2,"A33","∑ Wärmeabnehmer","∑ Wärmeabnehmer","∑ des consommateurs"]
[2,"B33","Gesamt-Wärmebedarf [MWh/a]","Gesamt-Wärmebedarf [MWh/a]","Besoin de chaleur globale [MWh/a]"]
[2,"B34","Gesamt-Wärmeleistungbedarf [kW]","Gesamt-Wärmeleistungbedarf [kW]","Puissance thermique à installer globale [kW]"]
[2,null," "," "," "," "]
[2,"A36","Berechnete Kennzahlen","Berechnete Kennzahlen","Données caractéristiques calculées","Berechnete Kennzahlen"]
[2,"A38","Allgemeines","Allgemeines","Généralités","Allgemeines"]
[2,"B38","Max. Vorlauftemperatur Wärmeabnehmer [°C]","Max. Vorlauftemperatur Wärmeabnehmer [°C]","Température aller consommateurs max. [°C]","Max. Vorlauftemperatur Wärmeabnehmer [°C]"]
[2,"B39","Max. Hauptrücklauftemperatur [°C]","Max. Hauptrücklauftemperatur [°C]","Température retour principale max. [°C]","Max. Hauptrücklauftemperatur [°C]"]
[2,"A40","Raumwärme","Raumwärme","Chaleur ambiante","Raumwärme"]
[2,"B40","Vollbetriebsstundenzahl Raumwärme [h/a]","Vollbetriebsstundenzahl Raumwärme [h/a]","Heures de marche à pleine charge chaleur ambiante [h/a]","Vollbetriebsstundenzahl Raumwärme [h/a]"]
[2,"B41","Spezifischer Heizwärmebedarf [kWh/m²a]","Spezifischer Heizwärmebedarf [kWh/m²a]","Besoin de chaleur spécifique [kWh/m²a]","Spezifischer Heizwärmebedarf [kWh/m²a]"]
[2,"B42","Spezifischer Wärmeleistungsbedarf [W/m²]","Spezifischer Wärmeleistungsbedarf [W/m²]","Puissance thermique spécifique requise [W/m²]","Spezifischer Wärmeleistungsbedarf [W/m²]"]
[2,"A43","Warmwasser","Warmwasser","Eau chaude","Warmwasser"]
[2,"B43","Vollbetriebsstundenzahl Warmwasser [h/a]","Vollbetriebsstundenzahl Warmwasser [h/a]","Heures de marche à pleine charge eau chaude [h/a]","Vollbetriebsstundenzahl Warmwasser [h/a]"]
[2,"B44","Spezifischer Energiebedarf Warmwasser [kWh/m²a]","Spezifischer Energiebedarf Warmwasser [kWh/m²a]","Besoin d'énergie spécifique eau chaude [kWh/m²a]","Spezifischer Energiebedarf Warmwasser [kWh/m²a]"]
[2,"A44","Prozesswärme","Prozesswärme","Chaleur industrielle","Prozesswärme"]
[2,"B45","Vollbetriebsstundenzahl Prozesswärme [h/a]","Vollbetriebsstundenzahl Prozesswärme [h/a]","Heures de marche à pleine charge chaleur industrielle [h/a]","Vollbetriebsstundenzahl Prozesswärme [h/a]"]
[null,null," "," "," "," "]
["Hilfs","S3","Ja","Ja","oui","Ja"]
["Hilfs","S4","Nein","Nein","non","Nein"]
["Hilfs","U3","Franken","Franken","Franc Suisse"]
["Hilfs","U4","Euro","Euro","Euro"]
["Hilfs","V3","Holzhackschnitzel","Holzhackschnitzel","Plaquettes de bois"]
["Hilfs","V4","Pellets","Pellets","Granulé"]
[null,null," "," "," "," "]
[1,"C11","Sanierung","Sanierung","Renovation","Neubauten"]
[1,"C14","Öl-Lieferung","Öl-Lieferung","Livraison de mazout"," "]
[1,"F11","Neubau","Neubau","Nouveau bâtiment"," "]
[1,"F14","SIA-Norm","SIA-Norm","Norme SIA ","SIA-Norm"]
[1,null," "," "," "," "]
[1,"D11","Altes","Altes","Ecole","Altes"]
[1,"D12","Schulhaus","Schulhaus","existente","Schulhaus"]
[1,"D13","Musterstrasse","Musterstrasse","Rue Echantillon","Musterstrasse"]
[1,"D14","Abrechnung","Abrechnung","Décompte","Verbrauch bisher"]
[1,null," "," "," "," "]
[1,"E11","Prozess","Prozess","Chaleur","Prozess"]
[1,"E12"," "," ","industrielle"," "]
[1,"E13"," "," "," "," "]
[1,"E14","Messung","Messung","Mesure","Messung"]
[]
["Q-Plan","A2","    Währungseinheit:                                      Brennstoff:","    Währungseinheit:                                      Brennstoff:","    Unité monétaire:                                      Combustible:"]
["Q-Plan",null,"Excel-Tabelle «Q-Plan»","Excel-Tabelle «Q-Plan»","Tableau Excel «Plan QM»"]
["Q-Plan",null,"Projekt-Kurzbezeichnung oder Projekt-Nr.","Projekt-Kurzbezeichnung oder Projekt-Nr.","Nom du projet ou projet No"]
["Q-Plan",null,"Planung","Planung","Planification"]
["Q-Plan",null,"Ist, MS 5","Ist, MS 5","État réel EP5"]
["Q-Plan",null,"Wärmebedarf aller Wärmeabnehmer","Wärmebedarf aller Wärmeabnehmer","Bilan énergétique de tous leur preneurs de chaleur"]
["Q-Plan",null,"          davon über das Wärmenetz","          davon über das Wärmenetz","          dont ceux raccordés au réseau"]
["Q-Plan",null,"Wärmeverluste  Wärmenetz","Wärmeverluste  Wärmenetz","Pertes thermiques du réseau de chaleur"]
["Q-Plan",null,"Gesamtwärmebedarf  (inkl. Verluste Wärmenetz)","Gesamtwärmebedarf  (inkl. Verluste Wärmenetz)","Bilan énergétique global (y compris pertes du réseau de chaleur)"]
["Q-Plan",null,"Wärmeleistungsbedarf  aller Wärmeabnehmer","Wärmeleistungsbedarf  aller Wärmeabnehmer","Puissance thermique de tous les preneurs de chaleur"]
["Q-Plan",null,"          davon über das Wärmenetz","          davon über das Wärmenetz","          dont ceux raccordés au réseau"]
["Q-Plan",null,{"$f":"IF(C$1=\"FR\",E131,IF(C$1=\"IT\",F131,D131))","v":"Wärmeleistungsverluste Wärmenetz"},"Wärmeleistungsverluste Wärmenetz","Pertes de puissance du réseau de chaleur"]
["Q-Plan",null,"Gesamt-Wärmeleistungsbedarf Wärmeerzeugung","Gesamt-Wärmeleistungsbedarf Wärmeerzeugung","Puissance thermique globale de la production de chaleur"]
["Q-Plan",null,"Trassenlänge Wärmenetz  (inkl. Hausanschlüsse)","Trassenlänge Wärmenetz  (inkl. Hausanschlüsse)","Longueur de fouilles du réseau de chaleur (y compris branchements d'immeubles)"]
["Q-Plan",null,"Nennleistung der/des  Holzkessel(s) mit Referenzbrennstoff","Nennleistung der/des  Holzkessel(s) mit Referenzbrennstoff","Puissance nominale de la (des) chaudière(s) à bois avec combustible de référence"]
["Q-Plan",null,"Nennleistung der Wärmeerzeugung mit anderen Energieträgern:  .......................................                                                                                    ","Nennleistung der Wärmeerzeugung mit anderen Energieträgern:  .......................................                                                                                    ","Puissance nominale de la production de chaleur avec d'autres vecteurs énergétiques…......"]
["Q-Plan",null,"Nennleistung der Wärmeerzeugung total","Nennleistung der Wärmeerzeugung total","Total puissance nominale de la production de chaleur"]
["Q-Plan",null,"Anteil der mit Holzenergie produzierte Wärmemenge","Anteil der mit Holzenergie produzierte Wärmemenge","Part de l'énergie produite avec du bois"]
["Q-Plan",null,"Mit Holzenergie produzierte Wärmemenge","Mit Holzenergie produzierte Wärmemenge","Énergie produite avec du bois"]
["Q-Plan",null,"Silogrösse netto","Silogrösse netto","Volume net du silo"]
["Q-Plan",null,"Füllgrad Silo","Füllgrad Silo","Taux de remplissage du silo"]
["Q-Plan",null,"Silogrösse brutto","Silogrösse brutto","Volume brut du silo"]
["Q-Plan",null,"Energie-Inhalt pro Schüttraummeter (Holzhackschnitzel)","Energie-Inhalt pro Schüttraummeter (Holzhackschnitzel)","Pouvoir calorifique par mètre cube de plaquettes"]
["Q-Plan",null,"Energie-Inhalt pro Kilogramm (Pellets)","Energie-Inhalt pro Kilogramm (Pellets)","Pouvoir calorifique par kilogramme de granulé"]
["Q-Plan",null,"Jährlicher Brennstoffverbrauch der/des Holzkessel(s) ","Jährlicher Brennstoffverbrauch der/des Holzkessel(s) ","Consommation annuelle de combustible"]
["Q-Plan",null,"Kosten","Kosten","Coûts"]
["Q-Plan",null,"Investitionskosten  Wärmeerzeugung ","Investitionskosten  Wärmeerzeugung ","Coûts d'investissements pour la production de chaleur"]
["Q-Plan",null,"Investitionskosten  Wärmenetz ","Investitionskosten  Wärmenetz ","Coûts d'investissements pour le réseau de chaleur"]
["Q-Plan",null,"Temperaturangaben im Auslegungspunkt","Temperaturangaben im Auslegungspunkt","Données de température au point de dimensionnement"]
["Q-Plan",null,"Temperatur Hauptvorlauf Fernleitung","Temperatur Hauptvorlauf Fernleitung","Température départ principal réseau à distance au point de mesure"]
["Q-Plan",null,"Temperatur Hauptrücklauf Fernleitung ","Temperatur Hauptrücklauf Fernleitung ","Température retour principal réseau à distance au point de mesure"]
["Q-Plan",null,"Kennzahlen","Kennzahlen","Caractéristiques"]
["Q-Plan",null,"Vereinbarung","Vereinbarung","convenue"]
["Q-Plan",null,"bzw. Zielwert","bzw. Zielwert","resp. valeur"]
["Q-Plan",null,"E.2.6 Vollbetriebsstundenzahl der Wärmeabnehmer","E.2.6 Vollbetriebsstundenzahl der Wärmeabnehmer","E.2.6 Nombre d'heures de fonctionnement à pleine charge\ndes preneurs de chaleur"]
["Q-Plan",null,"E.3.3 Anschlussdichte Wärmenetz","E.3.3 Anschlussdichte Wärmenetz","E.3.3 Densité de raccordement du réseau de chaleur"]
["Q-Plan",null,"E.3.3 Wärmeverluste Wärmenetz (% der zugeführten Wärme) ","E.3.3 Wärmeverluste Wärmenetz (% der zugeführten Wärme) ","E.3.3Pertes thermiques du réseau (% de la chaleur fournie)"]
["Q-Plan",null,"Wärmeverteilkosten pro Trm ","Wärmeverteilkosten pro Trm ","Coûts de la distribution de chaleur par mètre de fouille"]
["Q-Plan",null,"E.3.3 Spezifische Investitionskosten Wärmenetz","E.3.3 Spezifische Investitionskosten Wärmenetz","E.3.3 Coûts d'investissements spécifiques du réseau de chaleur"]
["Q-Plan",null,"E.4.10 Spezifische Investitionskosten Wärmeerzeugung","E.4.10 Spezifische Investitionskosten Wärmeerzeugung","E.4.10 Coûts d'investissements spécifiques de la production de chaleur"]
["Q-Plan",null,"E.4.4 Vollbetriebsstundenzahl der/des Holzkessel(s) ","E.4.4 Vollbetriebsstundenzahl der/des Holzkessel(s) ","E.4.4 Nombre d'heures de fonctionnement à pleine charge\nde la (des) chaudière(s) à bois"]
["Q-Plan",null,"E.4.6 Vollbetriebsstundenzahl andere Wärmeerzeuger","E.4.6 Vollbetriebsstundenzahl andere Wärmeerzeuger","E.4.6 Nombre d'heures de fonctionnement à pleine charge d'autres \nproducteurs de chaleur"]
["Q-Plan",null,"E.4.5 Silogrösse: Abdeckung des Vollastbedarfs für Anzahl Tage (+30Srm)","E.4.5 Silogrösse: Abdeckung des Vollastbedarfs für Anzahl Tage (+30Srm)","E.4.5 Volume du silo: couverture de la demande à pleine charge pour ……. Jours (+30 m3pl)"]
["Q-Plan",null,"E.4.5 Silogrösse: Abdeckung des Vollastbedarfs für Anzahl Tage","E.4.5 Silogrösse: Abdeckung des Vollastbedarfs für Anzahl Tage","E.4.5 Volume du silo: couverture de la demande à pleine charge pour ……. Jours"]
["Q-Plan",null,"Die grau hinterlegten Felder sind Eingabefelder","Die grau hinterlegten Felder sind Eingabefelder","Les champs grisés doivent être remplis"]
["Q-Plan",null,"Tage","Tage","Jours"]
["Q-Plan",null,"kWh/Srm","kWh/Srm","kWh/m3pl"]
["Q-Plan",null,"Srm","Srm","m3pl"]
["Q-Plan",null,{"$f":"IF(C$1=\"FR\",E168,IF(C$1=\"IT\",F168,D168))","v":"Trm"},"Trm","mF"]
["Q-Plan",null,"MWh/(a Trm)","MWh/(a Trm)","MWh/(a mF)"]
["Q-Plan",null,"CHF/Trm","CHF/Trm","CHF/mF"]
["Q-Plan",null,{"$f":"IF(C$1=\"FR\",E171,IF(C$1=\"IT\",F171,D171))","v":"€/Trm"},"€/Trm","€/mF"]
["Q-Plan",null,"Vordefinition von Währung und Brennstofftyp","Vordefinition von Währung und Brennstofftyp","Prédéfinition de la monnaie et le type de carburant"]
["Q-Plan",null,"Berechnungs-Basis oder Beispiel für Eingabewert in Spalte \"Planung\":","Berechnungs-Basis oder Beispiel für Eingabewert in Spalte \"Planung\":","Calcul basé ou un exemple de valeur d'entrée dans la colonne \"Planification\":"]
["Q-Plan",null,"Übernahme aus 'Verbraucher_Consommateurs' Zelle B3","Übernahme aus 'Verbraucher_Consommateurs' Zelle B3","Texte de la cellule B3 'Verbraucher_Consommateurs'"]
["Q-Plan",null,"Planungswert von 'Hilfsblatt'","Planungswert von 'Hilfsblatt'","Valeur de la planification de la feuille Excel 'Hilfsblatt'"]
["Q-Plan",null,"Eingabewert; Formeleingabe möglich","Eingabewert; Formeleingabe möglich","Valeur d'entrée; entrée possible de Formule"]
["Q-Plan",null,"Planungswert von 'Hilfsblatt'","Planungswert von 'Hilfsblatt'","Valeur de la planification de la feuille Excel 'Hilfsblatt'"]
["Q-Plan",null,"Berechneter Wert:","Berechneter Wert:","Valeur calculée:"]
["Q-Plan",null,"Planungswert von 'Anlage_Installation'","Planungswert von 'Anlage_Installation'","Valeur de la planification de la feuille Excel 'Anlage_Installation'"]
["Q-Plan",null,"Frei einzugebender Wert; Formeleingabe möglich","Frei einzugebender Wert; Formeleingabe möglich","valeur sélectionnable; entrée possible de Formule"]
["Q-Plan",null,"Planungswert von 'Anlage_Installation'","Planungswert von 'Anlage_Installation'","Valeur de la planification de la feuille Excel 'Anlage_Installation'"]
["Q-Plan",null,"Eingabewert; Formeleingabe möglich","Eingabewert; Formeleingabe möglich","Valeur d'entrée; entrée possible de Formule"]
["Q-Plan",null,"Planungswert von 'Wärmezentrale_Chauffage'","Planungswert von 'Wärmezentrale_Chauffage'","Valeur de la planification de la feuille Excel 'Wärmezentrale_Chauffage'"]
["Q-Plan",null,"Planungswert von 'Wärmezentrale_Chauffage'","Planungswert von 'Wärmezentrale_Chauffage'","Valeur de la planification de la feuille Excel 'Wärmezentrale_Chauffage'"]
["Q-Plan",null,"Planungswert von 'Hilfsblatt'","Planungswert von 'Hilfsblatt'","valeur de la planification de la Çfeuille auxiliaireÈ"]
["Q-Plan",null,"Eingabewert; Formeleingabe möglich","Eingabewert; Formeleingabe möglich","Valeur d'entrée; entrée possible de Formule"]
["Q-Plan",null,"Eingabewert; Formeleingabe möglich","Eingabewert; Formeleingabe möglich","Valeur d'entrée; entrée possible de Formule"]
["Q-Plan",null,"Eingabewert; Formeleingabe möglich","Eingabewert; Formeleingabe möglich","Valeur d'entrée; entrée possible de Formule"]
["Q-Plan",null,"Eingabewert; Formeleingabe möglich","Eingabewert; Formeleingabe möglich","Valeur d'entrée; entrée possible de Formule"]
["Q-Plan",null,"Eingabewert; Formeleingabe möglich","Eingabewert; Formeleingabe möglich","Valeur d'entrée; entrée possible de Formule"]
["Q-Plan",null,"Eingabewert; Formeleingabe möglich","Eingabewert; Formeleingabe möglich","Valeur d'entrée; entrée possible de Formule"]
["Q-Plan",null,"Eingabewert; Formeleingabe möglich","Eingabewert; Formeleingabe möglich","Valeur d'entrée; entrée possible de Formule"]
["Q-Plan",null,"; Jahrenutzungsgrad Holzkessel 85%","; Jahrenutzungsgrad Holzkessel 85%","; bois d'efficacité annuel chaudiéres 85%"]
[]
["WE",null,"Eingaben Hauptplaner","Eingaben Hauptplaner","Données planificateur principale"]
["WE",null,"Berechnete Kennzahlen","Berechnete Kennzahlen","Données caractéristiques calculées"]
["WE",null,"Eingabefelder","Eingabefelder","Champs a remplir"]
["WE",null,"Empfohlene Dateiformate: .xlsm oder .xls (Excel 97-2004)","Empfohlene Dateiformate: .xlsm oder .xls (Excel 97-2004)","Formats de fichiers recommandés: .xlsm oder .xls (Excel 97-2004)"]
["WE",null,"Keine","Keine","Aucun"]
["WE",null,"Wärmezentrale","Wärmezentrale","Centrale de chauffage"]
["WE",null,"Standard-Schaltung nach QMH","Standard-Schaltung nach QMH","Solution Standard de QM"]
["WE",null,"Nennleistung Holzkessel 1 (kl. Kessel bei WE1 – WE8) [kW]","Nennleistung Holzkessel 1 (kl. Kessel bei WE1 – WE8) [kW]","Puissance nominale chaudière à bois 1 (petit chaudière WE1 – WE8) [kW]"]
["WE",null,"Nennleistung Holzkessel 2 (gr. Kessel bei WE5 – WE8) [kW]","Nennleistung Holzkessel 2 (gr. Kessel bei WE5 – WE8) [kW]","Puissance nominale chaudière à bois 2 (grande chaudière WE1 – WE8) [kW]"]
["WE",null,"Nennleistung weitere Holzkessel Total [kW]","Nennleistung weitere Holzkessel Total [kW]","Puissance nominale plus chaudière à bois totale [kW]"]
["WE",null,"Anzahl installierte Holzkessel bei mehr als zwei Holzkessel [–]","Anzahl installierte Holzkessel bei mehr als zwei Holzkessel [–]","Nombre de chaudière à bois installé dans les systèmes à plusieurs chaudières à bois"]
["WE",null,"Nennleistung Holzkessel Total [kW]","Nennleistung Holzkessel Total [kW]","Puissance nominale chaudière à bois totale [kW]"]
["WE",null,"Nennleistung Bivalenkessel Total (z.B. Öl, Gas) [kW]","Nennleistung Bivalenkessel Total (z.B. Öl, Gas) [kW]","Puissance chaudière mazout/gaz totale [kW]"]
["WE",null,"Installiertes Speichervolumen [m3]","Installiertes Speichervolumen [m3]","Volume de l'accumulateur installée [m3]"]
["WE",null,"Temperaturspreizung über dem Speicher (Vorlauf – Rücklauf) [K]","Temperaturspreizung über dem Speicher (Vorlauf – Rücklauf) [K]","Le différentiel de température à travers l'accumulateur (départ – retour) [K]"]
["WE",null,"Minimale mittlere Tagesheizlast bei Schwachlastbetrieb (siehe Tabelle 20 unten) [%]","Minimale mittlere Tagesheizlast bei Schwachlastbetrieb (siehe Tabelle 20 unten) [%]","Moyenne de charge de chauffe journalière minimale en cas de fonctionnement à faible charge (voir tableau 20 ci-dessous) [kW]"]
["WE",null,"Maximale mittlere Holzkessel-Tagesleistung (Wert von 70% bis 100%)","Maximale mittlere Holzkessel-Tagesleistung (Wert von 70% bis 100%)","Performance journalière moyenne maximale de la chaudière à bois (valeur de 70% à 100%)"]
["WE",null,"Vollbetriebsstundenzahl der/des Holzkessel [h/a]","Vollbetriebsstundenzahl der/des Holzkessel [h/a]","Nombre d'heures de fonctionnement à pleine charge (chaudière à bois) [h/a]"]
["WE",null,"Vollbetriebsstundenzahl Bivalentkessel [h/a]","Vollbetriebsstundenzahl Bivalentkessel [h/a]","Nombre d'heures de fonctionnement à pleine charge (chaudière mazout/gaz) [h/a]"]
["WE",null,"Jahreswärmeproduktion mit Holz [%]","Jahreswärmeproduktion mit Holz [%]","Production annuelle de chaleur avec du bois [%]"]
["WE",null,"Speichergrösse [m3]","Speichergrösse [m3]","Volume de l'accumulateur [m3]"]
["WE",null,"Schwachlastbedingung [kW]","Schwachlastbedingung [kW]","Cas de fonctionnement à faible charge [kW]"]
["WE",null,"Auslegung Holzkessel","Auslegung Holzkessel","Dimensionnement de la puissance de la chaudière à bois"]
["WE",null,"Auslegung Holzkessel 1","Auslegung Holzkessel 1","Dimensionnement de la puissance de la chaudière à bois 1"]
["WE",null,"Auslegung Holzkessel 2","Auslegung Holzkessel 2","Dimensionnement de la puissance de la chaudière à bois 2"]
["WE",null,"Total","Total","Totalement"]
["WE",null,"Auslegung Bivalentkessel [kW]","Auslegung Bivalentkessel [kW]","Dimensionnement de la puissance de la chaudière mazout/gaz [kW]"]
["WE",null,"Ergebnis ≥ als Vergleichswert","Ergebnis ≥ als Vergleichswert","Résultat ≥ une valeur de comparaison"]
["WE",null,"Ergebnis ≤ als Vergleichswert (Zielwert)","Ergebnis ≤ als Vergleichswert (Zielwert)","Résultat ≤ une valeur de comparaison (valeur cible)"]
["WE",null,"Ergebnis ≥ oder ≤ als Vergleichswert (Zielbereich)","Ergebnis ≥ oder ≤ als Vergleichswert (Zielbereich)","Résultat ≥ ou ≤ à la valeur comparative (zone cible)"]
["WE",null,{"$f":"IF(C$1=\"FR\",E225,IF(C$1=\"IT\",F225,D225))","v":"Ergebnis"},"Ergebnis","Résultat"]
["WE",null,"Vergleich","Vergleich","Valeur de comparaison"]
["WE",null,{"$f":"IF(C$1=\"FR\",E227,IF(C$1=\"IT\",F227,D227))","v":"Standard-Schaltung wählen"},"Standard-Schaltung wählen","Sélectionnez Solution Standard de QM"]
["WE",null,"z.B. mehr als zwei Holzkessel","z.B. mehr als zwei Holzkessel","par exemple Installation à plusieurs chaudières à bois"]
["WE",null,"Wert eintragen","Wert eintragen","Entrer la valeur"]
["WE",null,"kein Wert eintragen","kein Wert eintragen","Ne pas entrer une valeur"]
["WE",null,"Wert aus Tabelle (unten) auswählen","Wert aus Tabelle (unten) auswählen","Sélectionnez une valeur dans le tableau (ci-dessous)"]
["WE",null,"Wert von 70% bis 100% eintragen","Wert von 70% bis 100% eintragen","Entrez une valeur de 70% à 100%"]
["WE",null,"WE1","WE1","WE1"]
["WE",null,"WE2","WE2","WE2"]
["WE",null,"WE3","WE3","WE3"]
["WE",null,"WE4","WE4","WE4"]
["WE",null,"WE5","WE5","WE5"]
["WE",null,"WE6","WE6","WE6"]
["WE",null,"WE7","WE7","WE7"]
["WE",null,"WE8","WE8","WE8"]
["WE",null,"1 Holzkessel ohne Speicher","1 Holzkessel ohne Speicher","1 chaudière à bois sans accumulateur"]
["WE",null,{"$f":"IF(C$1=\"FR\",E242,IF(C$1=\"IT\",F242,D242))","v":"1 Holzkessel mit Speicher"},"1 Holzkessel mit Speicher","1 chaudière à bois avec accumulateur"]
["WE",null,"1 Holzkessel + 1 Öl-/Gaskessel ohne Speicher","1 Holzkessel + 1 Öl-/Gaskessel ohne Speicher","1 chaudière à bois + 1 chaudière mazout/gaz sans accumulateur"]
["WE",null,"1 Holzkessel + 1 Öl-/Gaskessel mit Speicher","1 Holzkessel + 1 Öl-/Gaskessel mit Speicher","1 chaudière à bois + 1 chaudière mazout/gaz avec accumulateur"]
["WE",null,"2 Holzkessel ohne Speicher","2 Holzkessel ohne Speicher","2 chaudières à bois sans accumulateur"]
["WE",null,"2  Holzkessel mit Speicher","2  Holzkessel mit Speicher","2 chaudières à bois avec accumulateur"]
["WE",null,"2 Holzkessel + 1 Öl-/Gaskessel ohne Speicher","2 Holzkessel + 1 Öl-/Gaskessel ohne Speicher","2 chaudières à bois + 1 chaudière mazout/gaz sans accumulateur"]
["WE",null,"2 Holzkessel + 1 Öl-/Gaskessel mit Speicher","2 Holzkessel + 1 Öl-/Gaskessel mit Speicher","2 chaudières à bois + 1 chaudière mazout/gaz avec accumulateur"]
["WE",null,"Vergleich Leistungsdaten mit Energiedaten (Grafik unten Links in Bilder_DE)","Vergleich Leistungsdaten mit Energiedaten (Grafik unten Links in Bilder_DE)","Comparer les données de puissance avec données d'énergie (Figure ci-dessous liens dans Figures_FR)"]
["WE",null,"Temperaturspreizung berechnet aus Eingabedaten","Temperaturspreizung berechnet aus Eingabedaten","Écart de température calcul des données d'entrée"]
["WE",null,"Max. mittlere Bandquellen-Tagesleist. [kW]","Max. mittlere Bandquellen-Tagesleist. [kW]","Performance journalière moyenne maximale de la source de puissance de base [kW]"]

{"sheet":"Hilfsblatt","index":7,"n_rows":89,"n_cols":53,"rows_kept":89,"cut":false,"hidden":true,"merged":[[1,9,1,11]]}
[null,"Ausgezoge Lastkennlinien",null,null,null,null,null,"Wärmebedarfsbalken",null,null,null,null,null,null,null,null,null,null,{"$f":"IF(S2=1,\"Ja\",\"Nein\")","v":"Ja"},{"$f":"IF(T2=1,\"DE\",IF(T2=2,\"FR\",\"IT\"))","v":"DE"},"Währung","Brennstoff","WE",null,null,null,null,null,null,null,null,null,null,null,null,null,{"$f":"OFFSET($AK$2,AL1,0)","v":0},3,null,{"$f":"OFFSET($AN$2,AL1,0)","v":25}]
[null,null,null,null,null,null,null,null,"Energiedaten","Leistungsdaten",null,null,null,null,null,null,null,null,1,1,1,1,1]
["Passwort für EXCEL_Situationserfassung:","AT","Fernleitung","Prozess","Warmwasser","Raumwärme",null,null,"Jahr","Winter","Sommer","Jahr",null,null,null,null,null,null,{"$f":"Text!C98","v":"Ja"},"deutsch",{"$f":"Text!C100","v":"Franken"},{"$f":"Text!C102","v":"Holzhackschnitzel"},{"$f":"Text!C233","v":"WE1"},1500,null,null,null,null,null,null,null,null,null,null,null,null,3,"Deutschland (DE)",null,12]
["Holzenergie",{"$f":"C$31","v":-7},{"$f":"ROUND(Anlage_Installation!$C$22,3)","v":44.9},{"$f":"ROUND($C4+Anlage_Installation!$C$20*Anlage_Installation!$C$32,3)","v":100.9},{"$f":"ROUND($D4+Anlage_Installation!$C$19*Anlage_Installation!$C$30,3)","v":253.4},{"$f":"ROUND((B4-B5)*F12+F5,3)","v":1332.9349999999999},null,"Raumwärme",{"$f":"Anlage_Installation!C27","v":2792},{"$f":"D33","v":2797.8037439999998},null,{"$f":"SUM(J4:K4)","v":2797.8037439999998},"Chaleure ambiante",null,null,null,null,null,{"$f":"Text!C99","v":"Nein"},"français",{"$f":"Text!C101","v":"Euro"},{"$f":"Text!C103","v":"Pellets"},{"$f":"Text!C234","v":"WE2"},2000,null,null,null,null,null,null,null,null,null,null,null,null,6,"Österreich (AT)",null,20]
[null,{"$f":"Anlage_Installation!C$12-Anlage_Installation!C$13+Anlage_Installation!C$14","v":-12},{"$f":"ROUND(Anlage_Installation!$C$22,3)","v":44.9},{"$f":"ROUND($C5+Anlage_Installation!$C$20*Anlage_Installation!$C$32,3)","v":100.9},{"$f":"ROUND($D5+Anlage_Installation!$C$19*Anlage_Installation!$C$30,3)","v":253.4},{"$f":"ROUND($E5+Anlage_Installation!$C$18*SUM(Verbraucher_Consommateurs!$C$50:$IV$50),3)","v":1563.4},null,"Warmwasser",{"$f":"Anlage_Installation!C29","v":641},{"$f":"ROUND(Anlage_Installation!$C$29/8760*$J$9,3)","v":467.14},{"$f":"IF($S$1=\"Ja\",ROUND(Anlage_Installation!$C$29/8760*$K$9,3),\"\")","v":173.86},{"$f":"SUM(J5:K5)","v":641},"Eau chaude",null,null,null,null,null,null,"italienisch",null,null,{"$f":"Text!C235","v":"WE3"},2500,null,null,null,null,null,null,null,null,null,null,null,null,0,"Schweiz (CH)",null,25]
[null,{"$f":"Anlage_Installation!C$14","v":15},{"$f":"ROUND(Anlage_Installation!$C$22,3)","v":44.9},{"$f":"ROUND($C6+Anlage_Installation!$C$20*Anlage_Installation!$C$32,3)","v":100.9},{"$f":"ROUND($D6+Anlage_Installation!$C$19*Anlage_Installation!$C$30,3)","v":253.4},{"$f":"ROUND($E6+Anlage_Installation!$C$18*(Anlage_Installation!$C$17/100)*SUM(Verbraucher_Consommateurs!$C$50:$IV$50),3)","v":318.89999999999998},null,"Prozess",{"$f":"Anlage_Installation!C31","v":500},{"$f":"ROUND(Anlage_Installation!$C$31/8760*$J$9,3)","v":364.38400000000001},{"$f":"IF($S$1=\"Ja\",ROUND(Anlage_Installation!$C$31/8760*$K$9,3),\"\")","v":135.61600000000001},{"$f":"SUM(J6:K6)","v":500},"Chaleure industrielle",null,null,null,null,null,null,null,null,null,{"$f":"Text!C236","v":"WE4"},3500,null,null,null,null,null,null,null,null,null,null,null,null,9,"Slowenien (SI)",null,3]
[null,{"$f":"Anlage_Installation!C$14","v":15},{"$f":"IF($S$1=\"JA\",ROUND(Anlage_Installation!$C$22,3),0)","v":44.9},{"$f":"IF($S$1=\"JA\",ROUND($C7+Anlage_Installation!$C$20*Anlage_Installation!$C$32,3),0)","v":100.9},{"$f":"IF($S$1=\"JA\",ROUND($D7+Anlage_Installation!$C$19*Anlage_Installation!$C$30,3),0)","v":253.4},{"$f":"$E7","v":253.4},null,"Fernleitung",{"$f":"Anlage_Installation!C21","v":393.3},{"$f":"ROUND(Anlage_Installation!$C$22*$J$9/1000,3)","v":286.642},{"$f":"IF($S$1=\"Ja\",ROUND(Anlage_Installation!$C$22*$K$9/1000,3),\"\")","v":106.682},{"$f":"SUM(J7:K7)","v":393.32400000000001},"Conduite à distance",null,null,null,null,null,null,null,null,null,{"$f":"Text!C237","v":"WE5"},1500,null,null,null,null,null,null,null,null,null,null,null,null,12,"Italien (IT)",null,4]
[null,{"$f":"Anlage_Installation!C$13","v":20},{"$f":"IF($S$1=\"JA\",ROUND(Anlage_Installation!$C$22,3),0)","v":44.9},{"$f":"IF($S$1=\"JA\",ROUND($C8+Anlage_Installation!$C$20*Anlage_Installation!$C$32,3),0)","v":100.9},{"$f":"IF($S$1=\"JA\",ROUND($D8+Anlage_Installation!$C$19*Anlage_Installation!$C$30,3),0)","v":253.4},{"$f":"$E8","v":253.4},null,null,{"$f":"SUM(I4:I7)","v":4326.3},null,null,null,null,null,null,null,null,null,null,null,null,null,{"$f":"Text!C238","v":"WE6"},2000]
[null,30,{"$f":"IF($S$1=\"JA\",ROUND(Anlage_Installation!$C$22,3),0)","v":44.9},{"$f":"IF($S$1=\"JA\",ROUND($C9+Anlage_Installation!$C$20*Anlage_Installation!$C$32,3),0)","v":100.9},{"$f":"IF($S$1=\"JA\",ROUND($D9+Anlage_Installation!$C$19*Anlage_Installation!$C$30,3),0)","v":253.4},{"$f":"$E9","v":253.4},null,"Heizstunden",null,{"$f":"E32*24","v":6384},{"$f":"365*24-J9","v":2376},null,null,null,null,null,null,null,null,null,null,null,{"$f":"Text!C239","v":"WE7"},2500]
[null,null,null,null,null,null,null,null,null,null,null,null,null,null,null,null,null,null,null,null,null,null,{"$f":"Text!C240","v":"WE8"},3000,null,null,null,null,null,null,null,null,null,null,null,null,null,null,null,null,"CH",null,null,"DE",null,null,"AT",null,null,"SI",null,null,"IT"]
["Paralellverschiebung",null,null,null,null,{"$f":"ROUND(INDEX(LINEST(F$5:F$6,B$5:B$6),2)-E5,3)","v":756.88900000000001},null,"Gesamt",{"$f":"SUM(I4:I7)","v":4326.3},{"$f":"SUM(J4:J7)","v":3915.9697439999995},{"$f":"SUM(K4:K7)","v":416.15800000000002},{"$f":"SUM(L4:L7)","v":4332.1277439999994},"Total",null,null,null,null,null,null,null,null,null,{"$f":"Text!C199","v":"Keine"},"–",null,null,null,null,null,null,null,null,null,null,null,null,{"$f":"OFFSET($AK$12,AL11,0)","v":6},25]
["Steilheit",null,null,null,null,{"$f":"ROUND(INDEX(LINEST(F$5:F$6,B$5:B$6),1),3)","v":-46.093000000000004},null,"Holzkessel",null,{"$f":"AF32","v":3691.9828799999996},{"$f":"AF31","v":416.16115199999967},{"$f":"AF33","v":4108.1440319999992},"Chaudière à bois"]
[null,null,null,null,null,null,null,"Bandleistungsquelle",null,{"$f":"X32","v":0},{"$f":"X31","v":0},{"$f":"X33","v":0},"Source de puissance de base",null,null,null,null,null,null,null,null,null,null,null,null,null,null,null,null,null,null,null,null,null,null,null,{"$f":"IF(OFFSET($AO13,,$AK$1)=\"\",\"\",OFFSET($AN13,,$AK$1))","v":190},{"$f":"IF(OFFSET($AO13,,$AK$1)=\"\",\"\",OFFSET($AO13,,$AK$1))","v":"Andermatt (CH), 1442 m ü. M."},null,190,"Andermatt (CH), 1442 m ü. M.",null,62,"Augsburg (DE), 461 m ü. M.",null,122,"Bad Aussee (AT), 659 m ü. M.",null,42,"BILJE (SI), 55 m ü. M.",null,222,"Station 1"]
[null,"Unsichtbare Lastkennlinien",null,null,null,null,null,"Gesamt",null,{"$f":"J11/$L$11*100","v":90.393681244132779},9.6063187558672336,100,null,null,null,null,null,null,null,null,null,null,null,null,null,null,null,null,null,null,null,null,null,null,null,null,194,{"$f":"IF(OFFSET($AO14,,$AK$1)=\"\",\"\",OFFSET($AO14,,$AK$1))","v":"Acquarossa/Comprovasco (CH), 575 m ü. M."},null,194,"Acquarossa/Comprovasco (CH), 575 m ü. M.",null,66,"Bamberg (DE), 240 m ü. M.",null,126,"Bregenz (AT), 427 m ü. M.",null,38,"BRNIK LETALIŠČE (SI), 364 m ü. M.",null,226,"Station 2"]
[null,null,null,null,null,null,null,"Holzkessel",null,85.223315150699307,9.6063915145711753,94.829706665270493,null,null,null,null,null,null,null,null,null,null,null,null,null,null,null,null,null,null,null,null,null,null,null,null,198,"Bad Ragaz (CH), 496 m ü. M.",null,198,"Bad Ragaz (CH), 496 m ü. M.",null,50,"Frankfurt/Main Flughafen (DE), 112 m ü. M.",null,130,"Eisenstadt (AT), 182 m ü. M.",null,46,"NOVA VAS [BLOKE] (SI), 722 m ü. M.",null,230,"Station 3"]
[null,"AT","Fernleitung","Prozess","Warmwasser","Raumwärme",null,"Bandleistungsquelle",null,0,0,0,null,null,null,null,null,null,null,null,null,null,null,null,null,null,null,null,null,null,null,null,null,null,null,null,86,"Basel-Binningen (CH), 316 m ü. M.",null,86,"Basel-Binningen (CH), 316 m ü. M.",null,70,"Hof (DE), 565 m ü. M.",null,134,"Freistadt (AT), 560 m ü. M.",null,null,null,null,234,"Station 4"]
[null,{"$f":"C$31","v":-7},{"$f":"ROUND(Anlage_Installation!$C$22,3)","v":44.9},{"$f":"ROUND($C17+Anlage_Installation!$C$31*1000/8760,3)","v":101.97799999999999},{"$f":"ROUND($D17+Anlage_Installation!$C$29*1000/8760,3)","v":175.15199999999999},{"$f":"ROUND((B17-B18)*F25+F18,3)","v":1196.5920000000001},null,null,null,null,null,null,null,null,null,null,null,null,null,null,null,null,null,null,null,null,null,null,null,null,null,null,null,null,null,null,90,"Bern/Zollikofen (CH), 553 m ü. M.",null,90,"Bern/Zollikofen (CH), 553 m ü. M.",null,34,"Hohenpeißenberg (DE), 977 m ü. M.",null,138,"Fürstenfeld (AT), 276 m ü. M."]
[null,{"$f":"Anlage_Installation!C$12-Anlage_Installation!C$13+Anlage_Installation!C$14","v":-12},{"$f":"ROUND(Anlage_Installation!$C$22,3)","v":44.9},{"$f":"ROUND($C18+Anlage_Installation!$C$31*1000/8760,3)","v":101.97799999999999},{"$f":"ROUND($D18+Anlage_Installation!$C$29*1000/8760,3)","v":175.15199999999999},{"$f":"ROUND($E18+SUM(Verbraucher_Consommateurs!$C$49:$IV$49),3)","v":1414.652},null,null,null,null,null,null,null,null,null,null,null,null,null,null,null,null,null,null,null,null,null,null,null,null,null,null,null,null,null,null,238,"Bullet / La Fretaz (CH), 1205 m ü. M.",null,238,"Bullet / La Fretaz (CH), 1205 m ü. M.",null,58,"Kahler Asten (DE), 839 m ü. M.",null,14,"Graz Universität (AT), 353 m ü. M."]
[null,{"$f":"Anlage_Installation!C$14","v":15},{"$f":"ROUND(Anlage_Installation!$C$22,3)","v":44.9},{"$f":"ROUND($C19+Anlage_Installation!$C$31*1000/8760,3)","v":101.97799999999999},{"$f":"ROUND($D19+Anlage_Installation!$C$29*1000/8760,3)","v":175.15199999999999},{"$f":"ROUND($E19+Anlage_Installation!$C$17/100*SUM(Verbraucher_Consommateurs!$C$49:$IV$49),3)","v":237.12700000000001},null,null,null,null,null,null,null,null,null,null,null,null,null,null,null,null,null,null,null,null,null,null,null,null,null,null,null,null,null,null,202,"Château-d'Oex (CH), 1029 m ü. M.",null,202,"Château-d'Oex (CH), 1029 m ü. M.",null,26,"Karlsruhe/Rheinstetten (DE), 116 m ü. M.",null,142,"Hohenau/March (AT), 155 m ü. M."]
[null,{"$f":"Anlage_Installation!C$14","v":15},{"$f":"IF($S$1=\"JA\",ROUND(Anlage_Installation!$C$22,3),0)","v":44.9},{"$f":"IF($S$1=\"JA\",ROUND($C20+Anlage_Installation!$C$31*1000/8760,3),0)","v":101.97799999999999},{"$f":"IF($S$1=\"JA\",ROUND($D20+Anlage_Installation!$C$29*1000/8760,3),0)","v":175.15199999999999},{"$f":"$E20","v":175.15199999999999},null,null,null,null,null,null,null,null,null,null,null,null,null,null,null,null,null,null,null,null,null,null,null,null,null,null,null,null,null,null,2,"Davos (CH), 1594 m ü. M.",null,2,"Davos (CH), 1594 m ü. M.",null,74,"Kempten (DE), 705 m ü. M.",null,146,"Innsbruck Universität (AT), 574 m ü. M."]
[null,{"$f":"Anlage_Installation!C$13","v":20},{"$f":"IF($S$1=\"JA\",ROUND(Anlage_Installation!$C$22,3),0)","v":44.9},{"$f":"IF($S$1=\"JA\",ROUND($C21+Anlage_Installation!$C$31*1000/8760,3),0)","v":101.97799999999999},{"$f":"IF($S$1=\"JA\",ROUND($D21+Anlage_Installation!$C$29*1000/8760,3),0)","v":175.15199999999999},{"$f":"$E21","v":175.15199999999999},null,null,null,null,null,null,null,null,null,null,null,null,null,{"$f":"IF(AA$31=0,0,IF(AA$31>=L36,IF(L36>=T35,L36,IF(S$1=\"JA\",T35,IF(AA$31<=L36,AA$31,L36))),T35))","v":0},null,null,null,null,null,null,null,null,null,null,null,null,null,null,null,null,206,"Disentis/Sedrun (CH), 1197 m ü. M.",null,206,"Disentis/Sedrun (CH), 1197 m ü. M.",null,30,"München Flughafen (DE), 446 m ü. M.",null,150,"Klagenfurt Flughafen (AT), 446 m ü. M."]
[null,30,{"$f":"IF($S$1=\"JA\",ROUND(Anlage_Installation!$C$22,3),0)","v":44.9},{"$f":"IF($S$1=\"JA\",ROUND($C22+Anlage_Installation!$C$31*1000/8760,3),0)","v":101.97799999999999},{"$f":"IF($S$1=\"JA\",ROUND($D22+Anlage_Installation!$C$29*1000/8760,3),0)","v":175.15199999999999},{"$f":"$E22","v":175.15199999999999},null,null,null,null,null,null,null,null,null,null,null,null,null,null,null,null,null,null,null,null,null,null,null,null,null,null,null,null,null,null,242,"Einsiedeln (CH), 910 m ü. M.",null,242,"Einsiedeln (CH), 910 m ü. M.",null,78,"Nürnberg (DE), 314 m ü. M.",null,154,"Kufstein (AT), 499 m ü. M."]
[null,null,null,null,null,null,null,null,null,null,null,null,null,null,null,null,null,null,null,null,null,null,null,null,null,null,null,null,null,null,null,null,null,null,null,null,98,"Engelberg (CH), 1036 m ü. M.",null,98,"Engelberg (CH), 1036 m ü. M.",null,54,"Trier-Petrisberg (DE), 265 m ü. M.",null,158,"Lienz (AT), 673 m ü. M."]
["Paralellverschiebung",null,null,null,null,{"$f":"ROUND(INDEX(LINEST(F$18:F$19,B$18:B$19),2)-E18,3)","v":716.15599999999995},null,null,null,null,null,null,null,null,null,null,null,null,null,null,null,null,null,null,null,null,null,null,null,null,null,null,null,null,null,null,210,"Fribourg/Posieux (CH), 646 m ü. M.",null,210,"Fribourg/Posieux (CH), 646 m ü. M.",null,82,"Würzburg (DE), 268 m ü. M.",null,162,"Linz Stadt (AT), 266 m ü. M."]
["Steilheit",null,null,null,null,{"$f":"ROUND(INDEX(LINEST(F$18:F$19,B$18:B$19),1),3)","v":-43.612000000000002},null,null,null,null,null,null,null,null,null,null,null,null,null,null,null,null,null,null,null,null,null,null,null,null,null,null,null,null,null,null,94,"La Chaux-de-Fonds (CH), 1018 m ü. M.",null,94,"La Chaux-de-Fonds (CH), 1018 m ü. M.",null,null,null,null,166,"Mariazell (AT), 868 m ü. M."]
[null,null,null,null,null,null,null,null,null,null,null,null,null,null,null,null,null,null,null,null,null,null,null,null,"Bandquelle",null,"Min. Leistung",null,null,null,null,null,"Holzkessel",null,null,null,246,"Langnau i.E. (CH), 745 m ü. M.",null,246,"Langnau i.E. (CH), 745 m ü. M.",null,null,null,null,170,"Salzburg-Freisaal (AT), 424 m ü. M."]
[null,null,null,null,null,null,null,null,null,null,null,null,null,null,null,null,null,null,null,null,null,null,null,null,null,null,{"$f":"IF(T$1=\"FR\",IF(Figures_FR!M7=\"\",0,Figures_FR!M7),IF(T$1=\"SI\",IF(Bilder_IT!M6=\"\",0,Bilder_IT!M6),IF(Bilder_DE!M7=\"\",0,Bilder_DE!M7)))","v":135},{"$f":"AA27+Y31","v":135},null,{"$f":"MAX(AD34:AD87)","v":175.15199999999999},null,null,null,null,null,null,10,"Locarno/Monti (CH), 367 m ü. M.",null,10,"Locarno/Monti (CH), 367 m ü. M.",null,null,null,null,174,"Schröcken (AT), 1269 m ü. M."]
[null,null,null,null,null,null,null,null,null,null,null,null,null,null,null,null,null,null,null,null,null,null,{"$f":"IF(OR($G29=\"Acquarossa/Comprovasco (CH), 575 m ü. M.\",$G29=\"Pully (CH), 456 m ü. M.\",$G29=\"Schröcken (AT), 1269 m ü. M.\",$G29=\"Augsburg (DE), 461 m ü. M.\",$G29=\"Bamberg (DE), 240 m ü. M.\",$G29=\"Karlsruhe/Rheinstetten (DE), 116 m ü. M.\",$G29=\"BILJE (SI), 55 m ü. M.\"),2,1)","v":1},null,"Min. Leistung",null,"Max. Leistung",null,null,null,{"$f":"IF(OR($G29=\"Acquarossa/Comprovasco (CH), 575 m ü. M.\",$G29=\"Pully (CH), 456 m ü. M.\",$G29=\"Schröcken (AT), 1269 m ü. M.\",$G29=\"Augsburg (DE), 461 m ü. M.\",$G29=\"Bamberg (DE), 240 m ü. M.\",$G29=\"Karlsruhe/Rheinstetten (DE), 116 m ü. M.\",$G29=\"BILJE (SI), 55 m ü. M.\"),2,1)","v":1},null,"Min. Leistung",null,null,null,102,"Luzern (CH), 454 m ü. M.",null,102,"Luzern (CH), 454 m ü. M.",null,null,null,null,178,"St. Pölten (AT), 267 m ü. M."]
["Klimastation",null,null,null,null,null,{"$f":"OFFSET($AL$12,AL11,0)","v":"Zürich/Fluntern (CH), 556 m ü. M."},null,null,null,null,null,null,null,null,null,null,null,null,null,null,null,null,null,{"$f":"ROUND(MIN(Y33:Y87),0)","v":0},null,{"$f":"IF(T$1=\"FR\",IF(Figures_FR!M8=\"\",10^10,Figures_FR!M8),IF(T$1=\"IT\",IF(Bilder_IT!M7=\"\",10^10,Bilder_IT!M7),IF(Bilder_DE!M8=\"\",10^10,Bilder_DE!M8)))","v":810},{"$f":"AA29+Y31","v":810},null,null,null,null,{"$f":"ROUND(AD27-T31,0)","v":175},null,null,null,250,"Payerne (CH), 490 m ü. M.",null,250,"Payerne (CH), 490 m ü. M.",null,null,null,null,18,"Tamsweg (AT), 1022 m ü. M."]
[null,null,null,null,null,null,null,null,null,{"$f":"C31-B36","v":13},{"$f":"IF($S$1=\"JA\",365,$K$36)","v":365},{"$f":"$E$19","v":175.15199999999999},null,null,null,null,null,null,null,null,null,null,null,null,"Max. Leistung",null,"Bandleistung",null,null,null,null,null,"Max. Leistung",null,null,null,214,"Piotta (CH), 990 m ü. M.",null,214,"Piotta (CH), 990 m ü. M.",null,null,null,null,22,"Wien innere Stadt (AT), 170 m ü. M."]
["Tiefste Aussentemperatur [°C]",null,{"$f":"MIN(C36:C86)","v":-7},null,null,null,null,null,null,null,1,{"$f":"$L$30","v":175.15199999999999},null,null,null,null,null,null,null,{"$f":"MAX(T33:T89)","v":0},null,null,null,{"$f":"X33-X32","v":0},{"$f":"ROUND(MAX(Y33:Y87),0)","v":0},null,{"$f":"IF(T$1=\"FR\",IF(Figures_FR!M9=\"\",10^10,Figures_FR!M9),IF(T$1=\"IT\",IF(Bilder_IT!M8=\"\",10^10,Bilder_IT!M8),IF(Bilder_DE!M9=\"\",10^10,Bilder_DE!M9)))","v":0},null,null,null,null,{"$f":"AF33-AF32","v":416.16115199999967},{"$f":"ROUND(MAX(AG33:AG87),0)","v":804},null,null,null,106,"Pully (CH), 456 m ü. M.",null,106,"Pully (CH), 456 m ü. M.",null,null,null,null,182,"Zell am See (AT), 750 m ü. M."]
["Heiztage",null,null,null,{"$f":"ROUND(SUM(E36:E86)/24,1)","v":266},null,{"$f":"SUM(G36:G86)","v":365},null,null,null,null,null,null,null,null,null,null,null,null,null,null,null,null,{"$f":"SUM(X36:X86)","v":0},null,null,null,null,null,null,null,{"$f":"SUM(AF36:AF86)","v":3691.9828799999996},null,{"$f":"SUM(AH36:AH86)","v":3691.9828799999996},null,null,254,"Rünenberg (CH), 611 m ü. M.",null,254,"Rünenberg (CH), 611 m ü. M.",null,null,null,null,186,"Zeltweg (AT), 659 m ü. M."]
["Heizwärmebedarf [MWh/a] (inkl. nicht witterungsabhängigem Anteil)",null,null,{"$f":"SUM(D36:D86)/1000","v":2797.8037439999998},null,null,null,null,null,null,null,null,null,null,null,null,null,null,null,0,{"$f":"U34","v":0},null,{"$f":"SUM(W35:W86)","v":364},{"$f":"SUM(X35:X86)","v":0},null,null,{"$f":"T$31","v":0},{"$f":"AB34","v":365},null,null,{"$f":"SUM(AE35:AE86)","v":365},{"$f":"SUM(AF35:AF86)","v":4108.1440319999992},{"$f":"IF(S$1=\"NEIN\",0,IF(AA33>0,AA33,0))","v":0},null,null,null,110,"Samedan (CH), 1709 m ü. M.",null,110,"Samedan (CH), 1709 m ü. M."]
["Nicht witterunsabhängiger Anteil [MWh/a]",null,null,{"$f":"ROUND((F6-F7)*E32*24/1000,3)","v":418.15199999999999},null,null,null,null,null,null,365,{"$f":"IF($S$1=\"JA\",$L$30,0)","v":175.15199999999999},null,null,null,null,null,null,null,{"$f":"IF(AA$31=0,0,IF(AA$31>=L34,L34,AA$31))","v":0},{"$f":"IF(U89<365,U89,365)","v":0},{"$f":"IF(AND(T33=0,T34>0),$K34,\"\")","v":""},null,null,{"$f":"IF(T34>0,T34,0)","v":0},null,{"$f":"IF(L34<AB$27,AA33,IF(L34>AB$29,AA33,IF(L34<T$31,T$31,L34)))","v":175.15199999999999},{"$f":"IF(AB89<365,AB89,365)","v":365},{"$f":"IF(AND(AA33=T$31,AA34>T$31),IF(AB$27<T$31,K33,K34),\"\")","v":365},{"$f":"IF(AC34=\"\",\"\",AA34)","v":175.15199999999999},null,null,{"$f":"IF(S$1=\"NEIN\",0,IF(AA34>0,AA34,0))","v":175.15199999999999},null,null,null,114,"St. Gallen (CH), 776 m ü. M.",null,114,"St. Gallen (CH), 776 m ü. M."]
[null,null,null,null,null,null,null,null,null,null,{"$f":"E32","v":266},{"$f":"IF($S$1=\"JA\",$L$30,0)","v":175.15199999999999},null,null,null,null,null,null,null,{"$f":"IF(AA$31=0,0,IF(AA$31>=L35,IF(L35>=T34,L35,T34),T34))","v":0},{"$f":"IF(AND(T35=0,T36>0),K36,IF(T35=0,U$89,K35))","v":0},"",{"$f":"(365-U36)","v":365},{"$f":"W35*24*T35/1000","v":0},{"$f":"IF(T35>0,T35,0)","v":0},null,175.15199999999999,{"$f":"IF(AND(AA35=T$31,AA36>T$31),IF(AB$27<T$31,K35,K36),IF(AA35=T$31,AB$89,K35))","v":266},"",{"$f":"IF(AC35=\"\",\"\",AA35)","v":""},{"$f":"(365-AB36)","v":99},{"$f":"IF(AE36=0,0,AE35*24*(AA35-T36)/1000)","v":416.16115199999996},{"$f":"IF(S$1=\"NEIN\",0,IF(AA35>0,AA35,0))","v":175.15199999999999},{"$f":"AE35*AG35*24/1000","v":416.16115200000002},null,null,218,"Ulrichen (CH), 1346 m ü. M.",null,218,"Ulrichen (CH), 1346 m ü. M."]
[null,-20,{"$f":"IF(OR(G36=0,B36>B$6),\"\",B36)","v":""},{"$f":"IF(C36=\"\",\"\",ROUND((B36*F$25+F$24)*E36,3))","v":""},{"$f":"IF(C36=\"\",\"\",G36*24)","v":""},0,{"$f":"OFFSET(Klimadaten!$B$10,$F36,$AK$11)","v":0},{"$f":"G36","v":0},{"$f":"IF(OR($G36=0,$B36>$B$6),-10,$B36*$F$25+$F$24+$L$30)","v":-10},{"$f":"86+(B20-B22)-36","v":35},{"$f":"OFFSET(H$36,$J36,0)","v":266},{"$f":"OFFSET(I$36,$J36,0)","v":237.12799999999987},{"$f":"IF(G36=0,-25,B36)","v":-25},{"$f":"OFFSET(Klimadaten!$B$10,$F36,$AK$11-1)","v":0},{"$f":"N36","v":0},{"$f":"IF(N36=0,-25,$B36)","v":-25},{"$f":"OFFSET(Klimadaten!$B$10,$F36,$AK$11+1)","v":0},{"$f":"Q36","v":0},{"$f":"IF(Q36=0,-25,$B36)","v":-25},{"$f":"IF(AA$31=0,0,IF(AA$31>=L36,IF(L36>=T35,L36,T35),IF(S$1=\"JA\",T35,IF(AA$31<=L36,AA$31,L36))))","v":0},0,"",{"$f":"IF(AND(U36=W$28,U35>W$28),(U36-U37)+W$28,U36-U37)","v":0},{"$f":"W36*24*T36/1000","v":0},{"$f":"IF(T36>0,T36,0)","v":0},null,237.12799999999987,266,"","",{"$f":"IF(AND(AB36=AE$28,AB35>AE$28),(AB36-AB37)+AE$28,AB36-AB37)","v":16},{"$f":"AE36*24*(AA36-T36)/1000","v":91.057151999999945},{"$f":"IF(AA36>0,AA36-T36,0)","v":237.12799999999987},{"$f":"AE36*AG36*24/1000","v":91.057151999999945},null,null,118,"Visp (CH), 639 m ü. M.",null,118,"Visp (CH), 639 m ü. M."]
[null,{"$f":"B36+1","v":-19},"",{"$f":"IF(C37=\"\",\"\",ROUND((B37*F$25+F$24)*E37,3))","v":""},{"$f":"IF(C37=\"\",\"\",G37*24)","v":""},{"$f":"F36+1","v":1},{"$f":"OFFSET(Klimadaten!$B$10,$F37,$AK$11)","v":0},{"$f":"H36+G37","v":0},-10,{"$f":"IF(J36-1<J$30,J$30,J36-1)","v":34},{"$f":"OFFSET(H$36,$J37,0)","v":250},{"$f":"OFFSET(I$36,$J37,0)","v":280.73999999999995},{"$f":"IF(G37=0,-25,B37)","v":-25},{"$f":"OFFSET(Klimadaten!$B$10,$F37,$AK$11-1)","v":0},{"$f":"O36+N37","v":0},{"$f":"IF(N37=0,-25,$B37)","v":-25},{"$f":"OFFSET(Klimadaten!$B$10,$F37,$AK$11+1)","v":0},{"$f":"R36+Q37","v":0},{"$f":"IF(Q37=0,-25,$B37)","v":-25},{"$f":"IF(AA$31=0,0,IF(AA$31>=L37,IF(L37>=T36,L37,T36),T36))","v":0},0,"",0,0,{"$f":"IF(T37>0,T37,0)","v":0},null,280.73999999999995,250,"","",16,{"$f":"AE37*24*(AA37-T37)/1000","v":107.80415999999997},{"$f":"IF(AA37>0,AA37-T37,0)","v":280.73999999999995},107.80415999999997,null,null,6,"Zürich/Fluntern (CH), 556 m ü. M.",null,6,"Zürich/Fluntern (CH), 556 m ü. M."]
[null,-18,"","","",{"$f":"F37+1","v":2},{"$f":"OFFSET(Klimadaten!$B$10,$F38,$AK$11)","v":0},0,-10,{"$f":"IF(J37-1<J$30,J$30,J37-1)","v":33},234,324.35199999999992,{"$f":"IF(G38=0,-25,B38)","v":-25},{"$f":"OFFSET(Klimadaten!$B$10,$F38,$AK$11-1)","v":0},{"$f":"O37+N38","v":0},-25,{"$f":"OFFSET(Klimadaten!$B$10,$F38,$AK$11+1)","v":0},{"$f":"R37+Q38","v":0},{"$f":"IF(Q38=0,-25,$B38)","v":-25},0,0,"",0,0,0,null,324.35199999999992,234,"","",17,132.33561599999999,324.35199999999992,132.33561599999999]
[null,-17,"","","",3,{"$f":"OFFSET(Klimadaten!$B$10,$F39,$AK$11)","v":0},0,-10,32,217,367.96399999999988,-25,{"$f":"OFFSET(Klimadaten!$B$10,$F39,$AK$11-1)","v":0},0,-25,{"$f":"OFFSET(Klimadaten!$B$10,$F39,$AK$11+1)","v":0},0,-25,0,0,"",0,0,0,null,367.96399999999988,217,"","",17,150.12931199999994,367.96399999999988,150.12931199999994]
[null,-16,"","","",4,{"$f":"OFFSET(Klimadaten!$B$10,$F40,$AK$11)","v":0},0,-10,31,200,411.57599999999991,-25,{"$f":"OFFSET(Klimadaten!$B$10,$F40,$AK$11-1)","v":0},0,-25,{"$f":"OFFSET(Klimadaten!$B$10,$F40,$AK$11+1)","v":0},0,-25,0,0,"",0,0,0,null,411.57599999999991,200,"","",13,128.41171199999997,411.57599999999991,128.41171199999997]
[null,-15,"","","",5,{"$f":"OFFSET(Klimadaten!$B$10,$F41,$AK$11)","v":0},0,-10,30,187,455.18799999999993,-25,{"$f":"OFFSET(Klimadaten!$B$10,$F41,$AK$11-1)","v":0},0,-25,{"$f":"OFFSET(Klimadaten!$B$10,$F41,$AK$11+1)","v":0},0,-25,0,0,"",0,0,0,null,455.18799999999993,187,"","",13,142.01865599999999,455.18799999999993,142.01865599999999]
[null,-14,"","","",6,{"$f":"OFFSET(Klimadaten!$B$10,$F42,$AK$11)","v":0},0,-10,29,174,498.7999999999999,-25,{"$f":"OFFSET(Klimadaten!$B$10,$F42,$AK$11-1)","v":0},0,-25,{"$f":"OFFSET(Klimadaten!$B$10,$F42,$AK$11+1)","v":0},0,-25,0,0,"",0,0,0,null,498.7999999999999,174,"","",15,179.56799999999998,498.7999999999999,179.56799999999996]
[null,-13,"","","",7,{"$f":"OFFSET(Klimadaten!$B$10,$F43,$AK$11)","v":0},0,-10,28,159,542.41199999999992,-25,{"$f":"OFFSET(Klimadaten!$B$10,$F43,$AK$11-1)","v":0},0,-25,{"$f":"OFFSET(Klimadaten!$B$10,$F43,$AK$11+1)","v":0},0,-25,0,0,"",0,0,0,null,542.41199999999992,159,"","",14,182.25043199999996,542.41199999999992,182.25043199999996]
[null,-12,"","","",8,{"$f":"OFFSET(Klimadaten!$B$10,$F44,$AK$11)","v":0},0,-10,27,145,586.02399999999989,-25,{"$f":"OFFSET(Klimadaten!$B$10,$F44,$AK$11-1)","v":0},0,-25,{"$f":"OFFSET(Klimadaten!$B$10,$F44,$AK$11+1)","v":0},0,-25,0,0,"",0,0,0,null,586.02399999999989,145,"","",15,210.96863999999997,586.02399999999989,210.96863999999997]
[null,-11,"","","",9,{"$f":"OFFSET(Klimadaten!$B$10,$F45,$AK$11)","v":0},0,-10,26,130,629.63599999999997,-25,{"$f":"OFFSET(Klimadaten!$B$10,$F45,$AK$11-1)","v":0},0,-25,{"$f":"OFFSET(Klimadaten!$B$10,$F45,$AK$11+1)","v":0},0,-25,0,0,"",0,0,0,null,629.63599999999997,130,"","",14,211.55769599999999,629.63599999999997,211.55769599999996]
[null,-10,"","","",10,{"$f":"OFFSET(Klimadaten!$B$10,$F46,$AK$11)","v":0},0,-10,25,116,673.24799999999993,-25,{"$f":"OFFSET(Klimadaten!$B$10,$F46,$AK$11-1)","v":1},1,-10,{"$f":"OFFSET(Klimadaten!$B$10,$F46,$AK$11+1)","v":0},0,-25,0,0,"",0,0,0,null,673.24799999999993,116,"","",12,193.89542399999996,673.24799999999993,193.89542399999996]
[null,-9,"","","",11,{"$f":"OFFSET(Klimadaten!$B$10,$F47,$AK$11)","v":0},0,-10,24,104,716.8599999999999,-25,{"$f":"OFFSET(Klimadaten!$B$10,$F47,$AK$11-1)","v":1},2,-9,{"$f":"OFFSET(Klimadaten!$B$10,$F47,$AK$11+1)","v":0},0,-25,0,0,"",0,0,0,null,716.8599999999999,104,"","",13,223.66031999999998,716.8599999999999,223.66031999999996]
[null,-8,"","","",12,{"$f":"OFFSET(Klimadaten!$B$10,$F48,$AK$11)","v":0},0,-10,23,{"$f":"OFFSET(H$36,$J48,0)","v":91},760.47199999999998,-25,{"$f":"OFFSET(Klimadaten!$B$10,$F48,$AK$11-1)","v":3},5,-8,{"$f":"OFFSET(Klimadaten!$B$10,$F48,$AK$11+1)","v":0},0,-25,0,0,"",0,0,0,null,760.47199999999998,91,"","",17,310.27257600000002,760.47199999999998,310.27257600000002]
[null,-7,-7,24514.560000000001,24,13,{"$f":"OFFSET(Klimadaten!$B$10,$F49,$AK$11)","v":1},1,1196.5919999999999,22,74,804.08399999999983,-7,{"$f":"OFFSET(Klimadaten!$B$10,$F49,$AK$11-1)","v":4},9,-7,{"$f":"OFFSET(Klimadaten!$B$10,$F49,$AK$11+1)","v":0},0,-25,0,0,"",0,0,0,null,804.08399999999983,74,"","",14,270.17222399999991,804.08399999999983,270.17222399999991]
[null,-6,-6,46935.743999999999,48,14,{"$f":"OFFSET(Klimadaten!$B$10,$F50,$AK$11)","v":2},3,1152.98,21,60,847.69599999999991,-6,{"$f":"OFFSET(Klimadaten!$B$10,$F50,$AK$11-1)","v":4},13,-6,{"$f":"OFFSET(Klimadaten!$B$10,$F50,$AK$11+1)","v":0},0,-25,0,0,"",0,0,0,null,804.08399999999983,60,"","",13,250.87420799999995,804.08399999999983,250.87420799999992]
[null,-5,-5,112105.92,120,15,{"$f":"OFFSET(Klimadaten!$B$10,$F51,$AK$11)","v":5},8,1109.3679999999999,20,47,891.30799999999999,-5,{"$f":"OFFSET(Klimadaten!$B$10,$F51,$AK$11-1)","v":8},21,-5,{"$f":"OFFSET(Klimadaten!$B$10,$F51,$AK$11+1)","v":1},1,-5,0,0,"",0,0,0,null,804.08399999999983,47,"","",12,231.57619199999996,804.08399999999983,231.57619199999996]
[null,-4,-4,106872.48,120,16,{"$f":"OFFSET(Klimadaten!$B$10,$F52,$AK$11)","v":5},13,1065.7559999999999,19,35,934.91999999999985,-4,{"$f":"OFFSET(Klimadaten!$B$10,$F52,$AK$11-1)","v":8},29,-4,{"$f":"OFFSET(Klimadaten!$B$10,$F52,$AK$11+1)","v":3},4,-4,0,0,"",0,0,0,null,804.08399999999983,35,"","",8,154.38412799999998,804.08399999999983,154.38412799999998]
[null,-3,-3,142294.65599999999,168,17,{"$f":"OFFSET(Klimadaten!$B$10,$F53,$AK$11)","v":7},20,1022.144,18,27,978.53199999999993,-3,{"$f":"OFFSET(Klimadaten!$B$10,$F53,$AK$11-1)","v":11},40,-3,{"$f":"OFFSET(Klimadaten!$B$10,$F53,$AK$11+1)","v":4},8,-3,0,0,"",0,0,0,null,804.08399999999983,27,"","",7,135.08611199999996,804.08399999999983,135.08611199999996]
[null,-2,-2,134967.84,168,18,{"$f":"OFFSET(Klimadaten!$B$10,$F54,$AK$11)","v":7},27,978.53199999999993,17,20,1022.144,-2,{"$f":"OFFSET(Klimadaten!$B$10,$F54,$AK$11-1)","v":12},52,-2,{"$f":"OFFSET(Klimadaten!$B$10,$F54,$AK$11+1)","v":5},13,-2,0,0,"",{"$f":"IF(AND(U54=W$28,U53>W$28),(U54-U55)+W$28,U54-U55)","v":0},0,0,null,804.08399999999983,20,"","",{"$f":"IF(AND(AB54=AE$28,AB53>AE$28),(AB54-AB55)+AE$28,AB54-AB55)","v":7},135.08611199999996,804.08399999999983,135.08611199999996]
[null,-1,-1,145875.45600000001,192,19,{"$f":"OFFSET(Klimadaten!$B$10,$F55,$AK$11)","v":8},35,934.91999999999985,16,13,1065.7559999999999,-1,{"$f":"OFFSET(Klimadaten!$B$10,$F55,$AK$11-1)","v":15},67,-1,{"$f":"OFFSET(Klimadaten!$B$10,$F55,$AK$11+1)","v":5},18,-1,0,0,"",{"$f":"IF(AND(U55=W$28,U54>W$28),(U55-U56)+W$28,U55-U56)","v":0},0,0,null,804.08399999999983,13,"","",{"$f":"IF(AND(AB55=AE$28,AB54>AE$28),(AB55-AB56)+AE$28,AB55-AB56)","v":5},96.490079999999992,804.08399999999983,96.490079999999992]
[null,0,0,206252.92800000001,288,20,{"$f":"OFFSET(Klimadaten!$B$10,$F56,$AK$11)","v":12},47,891.30799999999999,15,8,1109.3679999999999,0,{"$f":"OFFSET(Klimadaten!$B$10,$F56,$AK$11-1)","v":18},85,0,{"$f":"OFFSET(Klimadaten!$B$10,$F56,$AK$11+1)","v":7},25,0,0,0,"",0,0,0,null,804.08399999999983,8,"","",5,96.490079999999992,804.08399999999983,96.490079999999992]
[null,1,1,209833.728,312,21,{"$f":"OFFSET(Klimadaten!$B$10,$F57,$AK$11)","v":13},60,847.69599999999991,14,3,1152.98,1,{"$f":"OFFSET(Klimadaten!$B$10,$F57,$AK$11-1)","v":18},103,1,{"$f":"OFFSET(Klimadaten!$B$10,$F57,$AK$11+1)","v":8},33,1,0,0,"",0,0,0,null,804.08399999999983,3,"","",2,38.596031999999994,804.08399999999983,38.596031999999994]
[null,2,2,211321.152,336,22,{"$f":"OFFSET(Klimadaten!$B$10,$F58,$AK$11)","v":14},74,804.08399999999983,13,1,1196.5919999999999,2,{"$f":"OFFSET(Klimadaten!$B$10,$F58,$AK$11-1)","v":15},118,2,{"$f":"OFFSET(Klimadaten!$B$10,$F58,$AK$11+1)","v":9},42,2,0,0,"",0,0,0,null,804.08399999999983,1,"","",1,19.298015999999997,804.08399999999983,19.298015999999997]
[null,3,3,238810.56,408,23,{"$f":"OFFSET(Klimadaten!$B$10,$F59,$AK$11)","v":17},91,760.47199999999998,13,1,1196.5919999999999,3,{"$f":"OFFSET(Klimadaten!$B$10,$F59,$AK$11-1)","v":14},132,3,{"$f":"OFFSET(Klimadaten!$B$10,$F59,$AK$11+1)","v":11},53,3,0,0,"",0,0,0,null,804.08399999999983,1,"","",0,0,804.08399999999983,0]
[null,4,4,169012.89600000001,312,24,{"$f":"OFFSET(Klimadaten!$B$10,$F60,$AK$11)","v":13},104,716.8599999999999,13,1,1196.5919999999999,4,{"$f":"OFFSET(Klimadaten!$B$10,$F60,$AK$11-1)","v":17},149,4,{"$f":"OFFSET(Klimadaten!$B$10,$F60,$AK$11+1)","v":13},66,4,0,0,"",{"$f":"IF(AND(U60=W$28,U59>W$28),(U60-U61)+W$28,U60-U61)","v":0},0,0,null,804.08399999999983,1,"","",{"$f":"IF(AND(AB60=AE$28,AB59>AE$28),(AB60-AB61)+AE$28,AB60-AB61)","v":0},0,804.08399999999983,0]
[null,5,5,143451.64799999999,288,25,{"$f":"OFFSET(Klimadaten!$B$10,$F61,$AK$11)","v":12},116,673.24799999999993,13,1,1196.5919999999999,5,{"$f":"OFFSET(Klimadaten!$B$10,$F61,$AK$11-1)","v":17},166,5,{"$f":"OFFSET(Klimadaten!$B$10,$F61,$AK$11+1)","v":12},78,5,0,0,"",0,0,0,null,804.08399999999983,1,"","",0,0,804.08399999999983,0]
[null,6,6,152706.62400000001,336,26,{"$f":"OFFSET(Klimadaten!$B$10,$F62,$AK$11)","v":14},130,629.63599999999997,13,1,1196.5919999999999,6,{"$f":"OFFSET(Klimadaten!$B$10,$F62,$AK$11-1)","v":16},182,6,{"$f":"OFFSET(Klimadaten!$B$10,$F62,$AK$11+1)","v":10},88,6,0,0,"",0,0,0,null,804.08399999999983,1,"","",0,0,804.08399999999983,0]
[null,7,7,147913.92000000001,360,27,{"$f":"OFFSET(Klimadaten!$B$10,$F63,$AK$11)","v":15},145,586.02399999999989,13,1,1196.5919999999999,7,{"$f":"OFFSET(Klimadaten!$B$10,$F63,$AK$11-1)","v":17},199,7,{"$f":"OFFSET(Klimadaten!$B$10,$F63,$AK$11+1)","v":13},101,7,0,0,"",0,0,0,null,804.08399999999983,1,"","",0,0,804.08399999999983,0]
[null,8,8,123399.36,336,28,{"$f":"OFFSET(Klimadaten!$B$10,$F64,$AK$11)","v":14},159,542.41199999999992,13,1,1196.5919999999999,8,{"$f":"OFFSET(Klimadaten!$B$10,$F64,$AK$11-1)","v":18},217,8,{"$f":"OFFSET(Klimadaten!$B$10,$F64,$AK$11+1)","v":12},113,8,0,0,"",0,0,0,null,804.08399999999983,1,"","",0,0,804.08399999999983,0]
[null,9,9,116513.28,360,29,{"$f":"OFFSET(Klimadaten!$B$10,$F65,$AK$11)","v":15},174,498.7999999999999,13,1,1196.5919999999999,9,{"$f":"OFFSET(Klimadaten!$B$10,$F65,$AK$11-1)","v":16},233,9,{"$f":"OFFSET(Klimadaten!$B$10,$F65,$AK$11+1)","v":11},124,9,0,0,"",0,0,0,null,804.08399999999983,1,"","",0,0,804.08399999999983,0]
[null,10,10,87371.232000000004,312,30,{"$f":"OFFSET(Klimadaten!$B$10,$F66,$AK$11)","v":13},187,455.18799999999993,13,1,1196.5919999999999,10,{"$f":"OFFSET(Klimadaten!$B$10,$F66,$AK$11-1)","v":16},249,10,{"$f":"OFFSET(Klimadaten!$B$10,$F66,$AK$11+1)","v":13},137,10,0,0,{"$f":"IF(AND(T65=0,T66>0),$K66,\"\")","v":""},0,0,0,null,{"$f":"IF(L66<AB$27,AA65,IF(L66>AB$29,AA65,IF(L66<T$31,T$31,L66)))","v":804.08399999999983},1,{"$f":"IF(AND(AA65=T$31,AA66>T$31),IF(AB$27<T$31,K65,K66),\"\")","v":""},"",0,0,804.08399999999983,0]
[null,11,11,73764.288,312,31,{"$f":"OFFSET(Klimadaten!$B$10,$F67,$AK$11)","v":13},200,411.57599999999991,13,1,1196.5919999999999,11,{"$f":"OFFSET(Klimadaten!$B$10,$F67,$AK$11-1)","v":19},268,11,{"$f":"OFFSET(Klimadaten!$B$10,$F67,$AK$11+1)","v":12},149,11,0,{"$f":"IF(AND(T67=0,T68>0),K68,IF(T67=0,U$89,K67))","v":0},"",0,0,0,null,804.08399999999983,{"$f":"IF(AND(AA67=T$31,AA68>T$31),IF(AB$27<T$31,K67,K68),IF(AA67=T$31,AB$89,K67))","v":1},"","",0,0,804.08399999999983,0]
[null,12,{"$f":"IF(OR(G68=0,B68>B$6),\"\",B68)","v":12},78667.296000000002,408,32,{"$f":"OFFSET(Klimadaten!$B$10,$F68,$AK$11)","v":17},217,{"$f":"IF(OR($G68=0,$B68>$B$6),-10,$B68*$F$25+$F$24+$L$30)","v":367.96399999999988},13,1,1196.5919999999999,12,{"$f":"OFFSET(Klimadaten!$B$10,$F68,$AK$11-1)","v":15},283,12,{"$f":"OFFSET(Klimadaten!$B$10,$F68,$AK$11+1)","v":12},161,12,0,0,"",0,0,0,null,804.08399999999983,1,"","",0,0,804.08399999999983,0]
[null,{"$f":"B68+1","v":13},13,60873.599999999999,408,33,{"$f":"OFFSET(Klimadaten!$B$10,$F69,$AK$11)","v":17},{"$f":"H68+G69","v":234},324.35199999999992,13,1,1196.5919999999999,13,{"$f":"OFFSET(Klimadaten!$B$10,$F69,$AK$11-1)","v":19},302,13,{"$f":"OFFSET(Klimadaten!$B$10,$F69,$AK$11+1)","v":11},172,13,{"$f":"IF(AA$31=0,0,IF(AA$31>=L69,IF(L69>=T68,L69,T68),T68))","v":0},0,"",0,0,0,null,804.08399999999983,1,"","",0,0,804.08399999999983,0]
[null,14,14,40545.792000000001,384,34,{"$f":"OFFSET(Klimadaten!$B$10,$F70,$AK$11)","v":16},250,280.73999999999995,13,1,1196.5919999999999,14,{"$f":"OFFSET(Klimadaten!$B$10,$F70,$AK$11-1)","v":18},320,14,{"$f":"OFFSET(Klimadaten!$B$10,$F70,$AK$11+1)","v":12},184,14,0,0,"",0,0,0,null,804.08399999999983,1,"","",0,0,804.08399999999983,0]
[null,15,15,23798.784,384,35,{"$f":"OFFSET(Klimadaten!$B$10,$F71,$AK$11)","v":16},266,237.12799999999987,13,1,1196.5919999999999,15,{"$f":"OFFSET(Klimadaten!$B$10,$F71,$AK$11-1)","v":15},335,15,{"$f":"OFFSET(Klimadaten!$B$10,$F71,$AK$11+1)","v":12},196,15,0,0,"",0,0,0,null,804.08399999999983,1,"","",0,0,804.08399999999983,0]
[null,16,"","","",36,{"$f":"OFFSET(Klimadaten!$B$10,$F72,$AK$11)","v":16},282,-10,13,1,1196.5919999999999,16,{"$f":"OFFSET(Klimadaten!$B$10,$F72,$AK$11-1)","v":11},346,16,{"$f":"OFFSET(Klimadaten!$B$10,$F72,$AK$11+1)","v":12},208,16,0,0,"",0,0,0,null,804.08399999999983,1,"","",0,0,804.08399999999983,0]
[null,17,"","","",37,{"$f":"OFFSET(Klimadaten!$B$10,$F73,$AK$11)","v":17},299,-10,13,1,1196.5919999999999,17,{"$f":"OFFSET(Klimadaten!$B$10,$F73,$AK$11-1)","v":10},356,17,{"$f":"OFFSET(Klimadaten!$B$10,$F73,$AK$11+1)","v":14},222,17,0,0,"",0,0,0,null,804.08399999999983,1,"","",0,0,804.08399999999983,0]
[null,18,"","","",38,{"$f":"OFFSET(Klimadaten!$B$10,$F74,$AK$11)","v":16},315,-10,13,1,1196.5919999999999,18,{"$f":"OFFSET(Klimadaten!$B$10,$F74,$AK$11-1)","v":6},362,18,{"$f":"OFFSET(Klimadaten!$B$10,$F74,$AK$11+1)","v":16},238,18,0,0,"",0,0,0,null,804.08399999999983,1,"","",0,0,804.08399999999983,0]
[null,19,"","","",39,{"$f":"OFFSET(Klimadaten!$B$10,$F75,$AK$11)","v":10},325,-10,13,1,1196.5919999999999,19,{"$f":"OFFSET(Klimadaten!$B$10,$F75,$AK$11-1)","v":3},365,19,{"$f":"OFFSET(Klimadaten!$B$10,$F75,$AK$11+1)","v":14},252,19,0,0,"",0,0,0,null,804.08399999999983,1,"","",0,0,804.08399999999983,0]
[null,20,"","","",40,{"$f":"OFFSET(Klimadaten!$B$10,$F76,$AK$11)","v":12},337,-10,13,1,1196.5919999999999,20,{"$f":"OFFSET(Klimadaten!$B$10,$F76,$AK$11-1)","v":0},365,-25,{"$f":"OFFSET(Klimadaten!$B$10,$F76,$AK$11+1)","v":13},265,20,0,0,"",0,0,0,null,804.08399999999983,1,"","",0,0,804.08399999999983,0]
[null,21,"","","",41,{"$f":"OFFSET(Klimadaten!$B$10,$F77,$AK$11)","v":10},347,-10,13,1,1196.5919999999999,21,{"$f":"OFFSET(Klimadaten!$B$10,$F77,$AK$11-1)","v":0},365,-25,{"$f":"OFFSET(Klimadaten!$B$10,$F77,$AK$11+1)","v":14},279,21,0,0,"",0,0,0,null,804.08399999999983,1,"","",0,0,804.08399999999983,0]
[null,22,"","","",42,{"$f":"OFFSET(Klimadaten!$B$10,$F78,$AK$11)","v":7},354,-10,13,1,1196.5919999999999,22,{"$f":"OFFSET(Klimadaten!$B$10,$F78,$AK$11-1)","v":0},365,-25,{"$f":"OFFSET(Klimadaten!$B$10,$F78,$AK$11+1)","v":12},291,22,0,0,"",0,0,0,null,804.08399999999983,1,"","",0,0,804.08399999999983,0]
[null,23,"","","",43,{"$f":"OFFSET(Klimadaten!$B$10,$F79,$AK$11)","v":5},359,-10,13,1,1196.5919999999999,23,{"$f":"OFFSET(Klimadaten!$B$10,$F79,$AK$11-1)","v":0},365,-25,{"$f":"OFFSET(Klimadaten!$B$10,$F79,$AK$11+1)","v":14},305,23,0,0,"",0,0,0,null,804.08399999999983,1,"","",0,0,804.08399999999983,0]
[null,24,"","","",44,{"$f":"OFFSET(Klimadaten!$B$10,$F80,$AK$11)","v":3},362,-10,13,1,1196.5919999999999,24,{"$f":"OFFSET(Klimadaten!$B$10,$F80,$AK$11-1)","v":0},365,-25,{"$f":"OFFSET(Klimadaten!$B$10,$F80,$AK$11+1)","v":10},315,24,0,0,"",0,0,0,null,804.08399999999983,1,"","",0,0,804.08399999999983,0]
[null,25,"","","",45,{"$f":"OFFSET(Klimadaten!$B$10,$F81,$AK$11)","v":2},364,-10,13,1,1196.5919999999999,25,{"$f":"OFFSET(Klimadaten!$B$10,$F81,$AK$11-1)","v":0},365,-25,{"$f":"OFFSET(Klimadaten!$B$10,$F81,$AK$11+1)","v":11},326,25,0,0,"",0,0,0,null,804.08399999999983,1,"","",0,0,804.08399999999983,0]
[null,26,"","","",46,{"$f":"OFFSET(Klimadaten!$B$10,$F82,$AK$11)","v":1},365,-10,13,1,1196.5919999999999,26,{"$f":"OFFSET(Klimadaten!$B$10,$F82,$AK$11-1)","v":0},365,-25,{"$f":"OFFSET(Klimadaten!$B$10,$F82,$AK$11+1)","v":9},335,26,0,0,"",0,0,0,null,804.08399999999983,1,"","",0,0,804.08399999999983,0]
[null,27,"","","",47,{"$f":"OFFSET(Klimadaten!$B$10,$F83,$AK$11)","v":0},365,-10,13,1,1196.5919999999999,-25,{"$f":"OFFSET(Klimadaten!$B$10,$F83,$AK$11-1)","v":0},365,-25,{"$f":"OFFSET(Klimadaten!$B$10,$F83,$AK$11+1)","v":8},343,27,0,0,"",0,0,0,null,804.08399999999983,1,"","",0,0,804.08399999999983,0]
[null,28,"","","",48,{"$f":"OFFSET(Klimadaten!$B$10,$F84,$AK$11)","v":0},365,-10,13,1,1196.5919999999999,-25,{"$f":"OFFSET(Klimadaten!$B$10,$F84,$AK$11-1)","v":0},365,-25,{"$f":"OFFSET(Klimadaten!$B$10,$F84,$AK$11+1)","v":6},349,28,0,0,"",0,0,0,null,804.08399999999983,1,"","",0,0,804.08399999999983,0]
[null,29,"","","",49,{"$f":"OFFSET(Klimadaten!$B$10,$F85,$AK$11)","v":0},365,-10,13,1,1196.5919999999999,-25,{"$f":"OFFSET(Klimadaten!$B$10,$F85,$AK$11-1)","v":0},365,-25,{"$f":"OFFSET(Klimadaten!$B$10,$F85,$AK$11+1)","v":6},355,29,0,0,"",0,0,0,null,804.08399999999983,1,"","",0,0,804.08399999999983,0]
[null,30,"","","",50,{"$f":"OFFSET(Klimadaten!$B$10,$F86,$AK$11)","v":0},365,-10,13,1,1196.5919999999999,-25,{"$f":"OFFSET(Klimadaten!$B$10,$F86,$AK$11-1)","v":0},365,-25,{"$f":"OFFSET(Klimadaten!$B$10,$F86,$AK$11+1)","v":10},365,30,0,0,"",{"$f":"IF(AND(U86=1,U85>1),(U86),U86-W$28)","v":-1},0,0,null,804.08399999999983,1,"","",{"$f":"IF(AND(AB86=1,AB85>1),(AB86),AB86-AE$28)","v":0},0,804.08399999999983,0]
[null,null,null,null,null,null,null,null,null,null,null,null,null,null,null,null,null,null,null,0,0,"",null,null,0,null,{"$f":"AA86","v":804.08399999999983},0,"","",null,null,804.08399999999983]
[null,null,null,null,null,null,null,null,null,null,null,null,null,null,null,null,null,null,null,0,0,null,null,null,null,null,{"$f":"T$31","v":0},0]
[null,null,null,null,null,null,null,null,null,null,null,null,null,null,null,null,null,null,null,0,{"$f":"MAX(V34:V87)","v":0},null,null,null,null,null,{"$f":"T$31","v":0},{"$f":"MAX(AC34:AC87)","v":365}]

{"sheet":"Klimadaten","index":8,"n_rows":60,"n_cols":257,"rows_kept":60,"cut":false,"hidden":true,"merged":[]}
[null,null,null,{"$f":"SUM(D10:D60)","v":365},null,null,null,{"$f":"SUM(H10:H60)","v":365},null,null,null,{"$f":"SUM(L10:L60)","v":365},null,null,null,{"$f":"SUM(P10:P60)","v":365},null,null,null,{"$f":"SUM(T10:T60)","v":365},null,null,null,{"$f":"SUM(X10:X60)","v":365},null,null,null,{"$f":"SUM(AB10:AB60)","v":365},null,null,null,{"$f":"SUM(AF10:AF60)","v":365},null,null,null,{"$f":"SUM(AJ10:AJ60)","v":365},null,null,null,{"$f":"SUM(AN10:AN60)","v":365},null,null,null,{"$f":"SUM(AR10:AR60)","v":365},null,null,null,{"$f":"SUM(AV10:AV60)","v":365},null,null,null,{"$f":"SUM(AZ10:AZ60)","v":365},null,null,null,{"$f":"SUM(BD10:BD60)","v":365},null,null,null,{"$f":"SUM(BH10:BH60)","v":365},null,null,null,{"$f":"SUM(BL10:BL60)","v":365},null,null,null,{"$f":"SUM(BP10:BP60)","v":365},null,null,null,{"$f":"SUM(BT10:BT60)","v":365},null,null,null,{"$f":"SUM(BX10:BX60)","v":365},null,null,null,{"$f":"SUM(CB10:CB60)","v":365},null,null,null,{"$f":"SUM(CF10:CF60)","v":365},null,null,null,{"$f":"SUM(CJ10:CJ60)","v":365},null,null,null,{"$f":"SUM(CN10:CN60)","v":365},null,null,null,{"$f":"SUM(CR10:CR60)","v":365},null,null,null,{"$f":"SUM(CV10:CV60)","v":365},null,null,null,{"$f":"SUM(CZ10:CZ60)","v":365},null,null,null,{"$f":"SUM(DD10:DD60)","v":365},null,null,null,{"$f":"SUM(DH10:DH60)","v":365},null,null,null,{"$f":"SUM(DL10:DL60)","v":365},null,null,null,{"$f":"SUM(DP10:DP60)","v":365},null,null,null,{"$f":"SUM(DT10:DT60)","v":365},null,null,null,{"$f":"SUM(DX10:DX60)","v":365},null,null,null,{"$f":"SUM(EB10:EB60)","v":365},null,null,null,{"$f":"SUM(EF10:EF60)","v":365},null,null,null,{"$f":"SUM(EJ10:EJ60)","v":365},null,null,null,{"$f":"SUM(EN10:EN60)","v":365},null,null,null,{"$f":"SUM(ER10:ER60)","v":365},null,null,null,{"$f":"SUM(EV10:EV60)","v":365},null,null,null,{"$f":"SUM(EZ10:EZ60)","v":365},null,null,null,{"$f":"SUM(FD10:FD60)","v":365},null,null,null,{"$f":"SUM(FH10:FH60)","v":365},null,null,null,{"$f":"SUM(FL10:FL60)","v":365},null,null,null,{"$f":"SUM(FP10:FP60)","v":365},null,null,null,{"$f":"SUM(FT10:FT60)","v":365},null,null,null,{"$f":"SUM(FX10:FX60)","v":365},null,null,null,{"$f":"SUM(GB10:GB60)","v":365},null,null,null,{"$f":"SUM(GF10:GF60)","v":365},null,null,null,{"$f":"SUM(GJ10:GJ60)","v":365},null,null,null,{"$f":"SUM(GN10:GN60)","v":365},null,null,null,{"$f":"SUM(GR10:GR60)","v":365},null,null,null,{"$f":"SUM(GV10:GV60)","v":365},null,null,null,{"$f":"SUM(GZ10:GZ60)","v":365},null,null,null,{"$f":"SUM(HD10:HD60)","v":365},null,null,null,{"$f":"SUM(HH10:HH60)","v":365},null,null,null,{"$f":"SUM(HL10:HL60)","v":365},null,null,null,{"$f":"SUM(HP10:HP60)","v":0},null,null,null,{"$f":"SUM(HT10:HT60)","v":0},null,null,null,{"$f":"SUM(HX10:HX60)","v":0},null,null,null,{"$f":"SUM(IB10:IB60)","v":0},null,null,null,{"$f":"SUM(IF10:IF60)","v":365},null,null,null,{"$f":"SUM(IJ10:IJ60)","v":365},null,null,null,{"$f":"SUM(IN10:IN60)","v":365},null,null,null,{"$f":"SUM(IR10:IR60)","v":365},null,null,null,{"$f":"SUM(IV10:IV60)","v":365}]
[]
[null,null,"Davos (CH)",null,null,null,"Zürich/Fluntern (CH)",null,null,null,"Locarno/Monti (CH)",null,null,null,"Graz Universität (AT)",null,null,null,"Tamsweg (AT)",null,null,null,"Wien innere Stadt (AT)",null,null,null,"Karlsruhe/Rheinstetten (DE)",null,null,null,"München Flughafen (DE)",null,null,null,"Hohenpeißenberg (DE)",null,null,null,"BRNIK LETALIŠČE (SI)",null,null,null,"BILJE (SI)",null,null,null,"NOVA VAS, BLOKE (SI)",null,null,null,"Frankfurt/Main Flughafen (DE)",null,null,null,"Trier-Petrisberg (DE)",null,null,null,"Kahler Asten (DE)",null,null,null,"Augsburg (DE)",null,null,null,"Bamberg (DE)",null,null,null,"Hof (DE)",null,null,null,"Kempten (DE)",null,null,null,"Nürnberg (DE)",null,null,null,"Würzburg (DE)",null,null,null,"Basel-Binningen (CH)",null,null,null,"Bern/Zollikofen (CH)",null,null,null,"La Chaux-de-Fonds (CH)",null,null,null,"Engelberg (CH)",null,null,null,"Luzern (CH)",null,null,null,"Pully (CH)",null,null,null,"Samedan (CH)",null,null,null,"St. Gallen (CH)",null,null,null,"Visp (CH)",null,null,null,"Bad Aussee (AT)",null,null,null,"Bregenz (AT)",null,null,null,"Eisenstadt (AT)",null,null,null,"Freistadt (AT)",null,null,null,"Fürstenfeld (AT)",null,null,null,"Hohenau/March (AT)",null,null,null,"Innsbruck Universität (AT)",null,null,null,"Klagenfurt Flughafen (AT)",null,null,null,"Kufstein (AT)",null,null,null,"Lienz (AT)",null,null,null,"Linz Stadt (AT)",null,null,null,"Mariazell (AT)",null,null,null,"Salzburg-Freisaal (AT)",null,null,null,"Schröcken (AT)",null,null,null,"St. Pölten (AT)",null,null,null,"Zell am See (AT)",null,null,null,"Zeltweg (AT)",null,null,null,"Andermatt (CH)",null,null,null,"Acquarossa/Comprovasco (CH)",null,null,null,"Bad Ragaz (CH)",null,null,null,"Château-d'Oex (CH)",null,null,null,"Disentis/Sedrun (CH)",null,null,null,"Fribourg/Posieux (CH)",null,null,null,"Piotta (CH)",null,null,null,"Ulrichen (CH)",null,null,null,"Italien 1",null,null,null,"Italien 2",null,null,null,"Italien 3",null,null,null,"Italien 4",null,null,null,"Bullet / La Fretaz (CH)",null,null,null,"Einsiedeln (CH)",null,null,null,"Langnau i.E. (CH)",null,null,null,"Payerne (CH)",null,null,null,"Rünenberg (CH)"]
[null,null,"10 Jahresmittel",null,null,null,"10 Jahresmittel",null,null,null,"10 Jahresmittel",null,null,null,"Steiermark",null,null,null,"Salzburg",null,null,null,"WIEN INNERE STADT",null,null,null,"10 Jahresmittel",null,null,null,"10 Jahresmittel",null,null,null,"10 Jahresmittel",null,null,null,"10 Jahresmittel",null,null,null,"10 Jahresmittel",null,null,null,"10 Jahresmittel",null,null,null,"10 Jahresmittel",null,null,null,"10 Jahresmittel",null,null,null,"10 Jahresmittel",null,null,null,"10 Jahresmittel",null,null,null,"10 Jahresmittel",null,null,null,"10 Jahresmittel",null,null,null,"10 Jahresmittel",null,null,null,"10 Jahresmittel",null,null,null,"10 Jahresmittel",null,null,null,"10 Jahresmittel",null,null,null,"10 Jahresmittel",null,null,null,"10 Jahresmittel",null,null,null,"10 Jahresmittel",null,null,null,"10 Jahresmittel",null,null,null,"10 Jahresmittel",null,null,null,"10 Jahresmittel",null,null,null,"10 Jahresmittel",null,null,null,"10 Jahresmittel",null,null,null,"10 Jahresmittel",null,null,null,"10 Jahresmittel",null,null,null,"10 Jahresmittel",null,null,null,"10 Jahresmittel",null,null,null,"10 Jahresmittel",null,null,null,"10 Jahresmittel",null,null,null,"10 Jahresmittel",null,null,null,"10 Jahresmittel",null,null,null,"10 Jahresmittel",null,null,null,"10 Jahresmittel",null,null,null,"10 Jahresmittel",null,null,null,"10 Jahresmittel",null,null,null,"10 Jahresmittel",null,null,null,"10 Jahresmittel",null,null,null,"10 Jahresmittel",null,null,null,"10 Jahresmittel",null,null,null,"10 Jahresmittel",null,null,null,"10 Jahresmittel",null,null,null,"10 Jahresmittel",null,null,null,"10 Jahresmittel",null,null,null,"10 Jahresmittel",null,null,null,"10 Jahresmittel",null,null,null,"10 Jahresmittel",null,null,null,"10 Jahresmittel",null,null,null,"10 Jahresmittel",null,null,null,"10 Jahresmittel",null,null,null,"10 Jahresmittel",null,null,null,"10 Jahresmittel",null,null,null,"10 Jahresmittel",null,null,null,"10 Jahresmittel",null,null,null,"10 Jahresmittel",null,null,null,"10 Jahresmittel",null,null,null,"10 Jahresmittel",null,null,null,"10 Jahresmittel"]
[null,null,"2002-2011",null,null,null,"2002-2011",null,null,null,"2002-2011",null,null,null,"2002-2011",null,null,null,"2002-2011",null,null,null,"2002-2011",null,null,null,"2002-2011",null,null,null,"2002-2011",null,null,null,"2002-2011",null,null,null,"1993-2002",null,null,null,"1993-2002",null,null,null,"1993-2002",null,null,null,"2002-2011",null,null,null,"2002-2011",null,null,null,"2002-2011",null,null,null,"2002-2011",null,null,null,"2002-2011",null,null,null,"2002-2011",null,null,null,"2002-2011",null,null,null,"2002-2011",null,null,null,"2002-2011",null,null,null,"2002-2011",null,null,null,"2002-2011",null,null,null,"2002-2011",null,null,null,"2002-2011",null,null,null,"2002-2011",null,null,null,"2002-2011",null,null,null,"2002-2011",null,null,null,"2002-2011",null,null,null,"2002-2011",null,null,null,"2002-2011",null,null,null,"2002-2011",null,null,null,"2002-2011",null,null,null,"2002-2011",null,null,null,"2002-2011",null,null,null,"2002-2011",null,null,null,"2002-2011",null,null,null,"2002-2011",null,null,null,"2002-2011",null,null,null,"2002-2011",null,null,null,"2002-2011",null,null,null,"2002-2011",null,null,null,"2002-2011",null,null,null,"2002-2011",null,null,null,"2002-2011",null,null,null,"2002-2011",null,null,null,"2002-2011",null,null,null,"2002-2011",null,null,null,"2002-2011",null,null,null,"2002-2011",null,null,null,"2002-2011",null,null,null,"2002-2011",null,null,null,"2002-2011",null,null,null,"2002-2011",null,null,null,"2002-2011",null,null,null,null,null,null,null,null,null,null,null,null,null,null,null,null,null,null,null,"2002-2011",null,null,null,"2002-2011",null,null,null,"2002-2011",null,null,null,"2002-2011",null,null,null,"2002-2011"]
[null,null,"Häufigkeit",null,null,null,"Häufigkeit",null,null,null,"Häufigkeit",null,null,null,"Häufigkeit",null,null,null,"Häufigkeit",null,null,null,"Häufigkeit",null,null,null,"Häufigkeit",null,null,null,"Häufigkeit",null,null,null,"Häufigkeit",null,null,null,"Häufigkeit",null,null,null,"Häufigkeit",null,null,null,"Häufigkeit",null,null,null,"Häufigkeit",null,null,null,"Häufigkeit",null,null,null,"Häufigkeit",null,null,null,"Häufigkeit",null,null,null,"Häufigkeit",null,null,null,"Häufigkeit",null,null,null,"Häufigkeit",null,null,null,"Häufigkeit",null,null,null,"Häufigkeit",null,null,null,"Häufigkeit",null,null,null,"Häufigkeit",null,null,null,"Häufigkeit",null,null,null,"Häufigkeit",null,null,null,"Häufigkeit",null,null,null,"Häufigkeit",null,null,null,"Häufigkeit",null,null,null,"Häufigkeit",null,null,null,"Häufigkeit",null,null,null,"Häufigkeit",null,null,null,"Häufigkeit",null,null,null,"Häufigkeit",null,null,null,"Häufigkeit",null,null,null,"Häufigkeit",null,null,null,"Häufigkeit",null,null,null,"Häufigkeit",null,null,null,"Häufigkeit",null,null,null,"Häufigkeit",null,null,null,"Häufigkeit",null,null,null,"Häufigkeit",null,null,null,"Häufigkeit",null,null,null,"Häufigkeit",null,null,null,"Häufigkeit",null,null,null,"Häufigkeit",null,null,null,"Häufigkeit",null,null,null,"Häufigkeit",null,null,null,"Häufigkeit",null,null,null,"Häufigkeit",null,null,null,"Häufigkeit",null,null,null,"Häufigkeit",null,null,null,"Häufigkeit",null,null,null,"Häufigkeit",null,null,null,"Häufigkeit",null,null,null,"Häufigkeit",null,null,null,"Häufigkeit",null,null,null,"Häufigkeit",null,null,null,"Häufigkeit",null,null,null,"Häufigkeit",null,null,null,"Häufigkeit",null,null,null,"Häufigkeit",null,null,null,"Häufigkeit",null,null,null,"Häufigkeit",null,null,null,"Häufigkeit"]
[null,null,"Min.","Mittel","Max.",null,"Min.","Mittel","Max.",null,"Min.","Mittel","Max.",null,"Min.","Mittel","Max.",null,"Min.","Mittel","Max.",null,"Min.","Mittel","Max.",null,"Min.","Mittel","Max.",null,"Min.","Mittel","Max.",null,"Min.","Mittel","Max.",null,"Min.","Mittel","Max.",null,"Min.","Mittel","Max.",null,"Min.","Mittel","Max.",null,"Min.","Mittel","Max.",null,"Min.","Mittel","Max.",null,"Min.","Mittel","Max.",null,"Min.","Mittel","Max.",null,"Min.","Mittel","Max.",null,"Min.","Mittel","Max.",null,"Min.","Mittel","Max.",null,"Min.","Mittel","Max.",null,"Min.","Mittel","Max.",null,"Min.","Mittel","Max.",null,"Min.","Mittel","Max.",null,"Min.","Mittel","Max.",null,"Min.","Mittel","Max.",null,"Min.","Mittel","Max.",null,"Min.","Mittel","Max.",null,"Min.","Mittel","Max.",null,"Min.","Mittel","Max.",null,"Min.","Mittel","Max.",null,"Min.","Mittel","Max.",null,"Min.","Mittel","Max.",null,"Min.","Mittel","Max.",null,"Min.","Mittel","Max.",null,"Min.","Mittel","Max.",null,"Min.","Mittel","Max.",null,"Min.","Mittel","Max.",null,"Min.","Mittel","Max.",null,"Min.","Mittel","Max.",null,"Min.","Mittel","Max.",null,"Min.","Mittel","Max.",null,"Min.","Mittel","Max.",null,"Min.","Mittel","Max.",null,"Min.","Mittel","Max.",null,"Min.","Mittel","Max.",null,"Min.","Mittel","Max.",null,"Min.","Mittel","Max.",null,"Min.","Mittel","Max.",null,"Min.","Mittel","Max.",null,"Min.","Mittel","Max.",null,"Min.","Mittel","Max.",null,"Min.","Mittel","Max.",null,"Min.","Mittel","Max.",null,"Min.","Mittel","Max.",null,"Min.","Mittel","Max.",null,"Min.","Mittel","Max.",null,"Min.","Mittel","Max.",null,"Min.","Mittel","Max.",null,"Min.","Mittel","Max.",null,"Min.","Mittel","Max.",null,"Min.","Mittel","Max.",null,"Min.","Mittel","Max.",null,"Min.","Mittel","Max.",null,"Min.","Mittel","Max."]
[null,0,{"$f":"B8+1","v":1},{"$f":"C8+1","v":2},3,4,5,6,7,8,9,10,11,12,13,14,15,16,17,18,19,20,21,22,23,24,25,26,27,28,29,30,31,32,33,34,35,36,37,38,39,40,41,42,43,44,45,46,47,48,49,50,51,52,53,54,55,56,57,58,59,60,61,62,63,64,65,{"$f":"BO8+1","v":66},67,68,69,70,71,72,73,74,75,76,77,78,79,80,81,82,83,84,85,86,87,88,89,90,91,92,93,94,95,96,97,98,99,100,101,102,103,104,105,106,107,108,109,110,111,112,113,114,115,116,117,118,119,120,121,122,123,124,125,126,127,128,129,{"$f":"EA8+1","v":130},131,132,133,134,135,136,137,138,139,140,141,142,143,144,145,146,147,148,149,150,151,152,153,154,155,156,157,158,159,160,161,162,163,164,165,166,167,168,169,170,171,172,173,174,175,176,177,178,179,180,181,182,183,184,185,186,187,188,189,190,191,192,193,{"$f":"GM8+1","v":194},195,196,197,198,199,200,201,202,203,204,205,206,207,208,209,210,211,212,213,214,215,216,217,218,219,{"$f":"HM8+1","v":220},221,222,223,224,225,226,227,228,229,230,231,232,233,234,235,{"$f":"IC8+1","v":236},{"$f":"ID8+1","v":237},{"$f":"IE8+1","v":238},{"$f":"IF8+1","v":239},{"$f":"IG8+1","v":240},{"$f":"IH8+1","v":241},{"$f":"II8+1","v":242},{"$f":"IJ8+1","v":243},{"$f":"IK8+1","v":244},{"$f":"IL8+1","v":245},{"$f":"IM8+1","v":246},{"$f":"IN8+1","v":247},{"$f":"IO8+1","v":248},{"$f":"IP8+1","v":249},{"$f":"IQ8+1","v":250},{"$f":"IR8+1","v":251},{"$f":"IS8+1","v":252},{"$f":"IT8+1","v":253},{"$f":"IU8+1","v":254},{"$f":"IV8+1","v":255}]
[]
[-20,null,1,0,0,null,0,0,0,null,0,0,0,null,0,0,0,null,2,0,0,null,0,0,0,null,0,0,0,null,0,0,0,null,0,0,0,null,0,0,0,null,0,0,0,null,1,0,0,null,0,0,0,null,0,0,0,null,0,0,0,null,0,0,0,null,0,0,0,null,0,0,0,null,0,0,0,null,0,0,0,null,0,0,0,null,0,0,0,null,0,0,0,null,0,0,0,null,0,0,0,null,0,0,0,null,0,0,0,null,32,1,0,null,0,0,0,null,0,0,0,null,0,0,0,null,0,0,0,null,0,0,0,null,0,0,0,null,0,0,0,null,0,0,0,null,0,0,0,null,0,0,0,null,0,0,0,null,0,0,0,null,0,0,0,null,1,0,0,null,0,0,0,null,0,0,0,null,0,0,0,null,0,0,0,null,1,0,0,null,1,0,0,null,0,0,0,null,0,0,0,null,0,0,0,null,0,0,0,null,0,0,0,null,0,0,0,null,17,0,0,null,null,null,null,null,null,null,null,null,null,null,null,null,null,null,null,null,0,0,0,null,0,0,0,null,0,0,0,null,0,0,0,null,0,0,0]
[-19,null,0,0,0,null,0,0,0,null,0,0,0,null,0,0,0,null,2,0,0,null,0,0,0,null,0,0,0,null,0,0,0,null,0,0,0,null,0,0,0,null,0,0,0,null,1,0,0,null,0,0,0,null,0,0,0,null,0,0,0,null,0,0,0,null,0,0,0,null,0,0,0,null,0,0,0,null,0,0,0,null,0,0,0,null,0,0,0,null,0,0,0,null,1,0,0,null,0,0,0,null,0,0,0,null,0,0,0,null,6,1,0,null,0,0,0,null,0,0,0,null,0,0,0,null,0,0,0,null,0,0,0,null,1,0,0,null,0,0,0,null,0,0,0,null,0,0,0,null,0,0,0,null,0,0,0,null,0,0,0,null,0,0,0,null,1,0,0,null,0,0,0,null,0,0,0,null,0,0,0,null,0,0,0,null,1,0,0,null,1,0,0,null,0,0,0,null,0,0,0,null,0,0,0,null,0,0,0,null,0,0,0,null,0,0,0,null,4,1,0,null,null,null,null,null,null,null,null,null,null,null,null,null,null,null,null,null,0,0,0,null,0,0,0,null,0,0,0,null,0,0,0,null,0,0,0]
[-18,null,2,0,0,null,0,0,0,null,0,0,0,null,0,0,0,null,2,0,0,null,0,0,0,null,0,0,0,null,0,0,0,null,0,0,0,null,0,0,0,null,0,0,0,null,0,0,0,null,0,0,0,null,0,0,0,null,0,0,0,null,0,0,0,null,0,0,0,null,0,0,0,null,1,0,0,null,0,0,0,null,0,0,0,null,0,0,0,null,0,0,0,null,1,0,0,null,0,0,0,null,0,0,0,null,0,0,0,null,6,1,0,null,0,0,0,null,0,0,0,null,0,0,0,null,0,0,0,null,0,0,0,null,1,0,0,null,0,0,0,null,0,0,0,null,0,0,0,null,0,0,0,null,0,0,0,null,1,0,0,null,0,0,0,null,0,0,0,null,0,0,0,null,0,0,0,null,0,0,0,null,0,0,0,null,1,0,0,null,1,0,0,null,0,0,0,null,0,0,0,null,0,0,0,null,0,0,0,null,0,0,0,null,0,0,0,null,4,1,0,null,null,null,null,null,null,null,null,null,null,null,null,null,null,null,null,null,0,0,0,null,1,0,0,null,0,0,0,null,0,0,0,null,0,0,0]
[-17,null,3,0,0,null,0,0,0,null,0,0,0,null,0,0,0,null,2,0,0,null,0,0,0,null,0,0,0,null,1,0,0,null,0,0,0,null,1,0,0,null,0,0,0,null,1,0,0,null,0,0,0,null,0,0,0,null,0,0,0,null,1,0,0,null,0,0,0,null,0,0,0,null,1,0,0,null,0,0,0,null,0,0,0,null,0,0,0,null,0,0,0,null,1,0,0,null,0,0,0,null,0,0,0,null,0,0,0,null,6,2,0,null,0,0,0,null,1,0,0,null,1,0,0,null,0,0,0,null,0,0,0,null,1,0,0,null,0,0,0,null,1,0,0,null,0,0,0,null,0,0,0,null,0,0,0,null,1,0,0,null,0,0,0,null,1,0,0,null,0,0,0,null,1,0,0,null,0,0,0,null,1,0,0,null,2,0,0,null,3,0,0,null,0,0,0,null,0,0,0,null,1,0,0,null,0,0,0,null,0,0,0,null,0,0,0,null,7,1,0,null,null,null,null,null,null,null,null,null,null,null,null,null,null,null,null,null,0,0,0,null,0,0,0,null,0,0,0,null,0,0,0,null,0,0,0]
[-16,null,4,0,0,null,0,0,0,null,0,0,0,null,0,0,0,null,3,1,0,null,0,0,0,null,0,0,0,null,1,0,0,null,0,0,0,null,1,0,0,null,0,0,0,null,1,0,0,null,0,0,0,null,0,0,0,null,0,0,0,null,1,0,0,null,1,0,0,null,1,0,0,null,2,0,0,null,0,0,0,null,0,0,0,null,0,0,0,null,0,0,0,null,2,0,0,null,1,0,0,null,0,0,0,null,0,0,0,null,7,2,0,null,0,0,0,null,1,0,0,null,1,0,0,null,0,0,0,null,0,0,0,null,0,0,0,null,1,0,0,null,1,0,0,null,0,0,0,null,1,0,0,null,0,0,0,null,1,0,0,null,0,0,0,null,2,0,0,null,0,0,0,null,1,0,0,null,0,0,0,null,0,0,0,null,2,0,0,null,3,1,0,null,0,0,0,null,0,0,0,null,0,0,0,null,0,0,0,null,0,0,0,null,0,0,0,null,5,2,0,null,null,null,null,null,null,null,null,null,null,null,null,null,null,null,null,null,0,0,0,null,2,0,0,null,0,0,0,null,0,0,0,null,0,0,0]
[-15,null,3,0,0,null,0,0,0,null,0,0,0,null,0,0,0,null,3,1,0,null,0,0,0,null,0,0,0,null,1,0,0,null,0,0,0,null,0,0,0,null,0,0,0,null,3,0,0,null,0,0,0,null,0,0,0,null,0,0,0,null,0,0,0,null,1,0,0,null,1,0,0,null,1,0,0,null,1,0,0,null,0,0,0,null,0,0,0,null,0,0,0,null,4,0,0,null,2,0,0,null,0,0,0,null,0,0,0,null,7,4,0,null,0,0,0,null,1,0,0,null,1,0,0,null,0,0,0,null,0,0,0,null,2,0,0,null,1,0,0,null,1,0,0,null,0,0,0,null,1,0,0,null,0,0,0,null,3,0,0,null,0,0,0,null,2,0,0,null,1,0,0,null,2,0,0,null,0,0,0,null,1,0,0,null,4,1,0,null,3,1,0,null,0,0,0,null,0,0,0,null,2,0,0,null,0,0,0,null,0,0,0,null,0,0,0,null,6,2,0,null,null,null,null,null,null,null,null,null,null,null,null,null,null,null,null,null,0,0,0,null,2,0,0,null,0,0,0,null,0,0,0,null,0,0,0]
[-14,null,5,1,0,null,0,0,0,null,0,0,0,null,0,0,0,null,4,1,0,null,0,0,0,null,0,0,0,null,2,0,0,null,0,0,0,null,1,0,0,null,0,0,0,null,2,0,0,null,0,0,0,null,0,0,0,null,1,0,0,null,1,0,0,null,1,0,0,null,2,0,0,null,3,0,0,null,1,0,0,null,1,0,0,null,0,0,0,null,0,0,0,null,2,0,0,null,2,0,0,null,0,0,0,null,0,0,0,null,7,4,0,null,0,0,0,null,2,0,0,null,1,0,0,null,0,0,0,null,0,0,0,null,2,0,0,null,0,0,0,null,1,0,0,null,0,0,0,null,1,0,0,null,1,0,0,null,3,0,0,null,0,0,0,null,2,1,0,null,1,0,0,null,2,0,0,null,1,0,0,null,2,0,0,null,3,0,0,null,5,1,0,null,0,0,0,null,0,0,0,null,2,0,0,null,1,0,0,null,0,0,0,null,0,0,0,null,5,3,0,null,null,null,null,null,null,null,null,null,null,null,null,null,null,null,null,null,0,0,0,null,1,0,0,null,1,0,0,null,0,0,0,null,0,0,0]
[-13,null,7,2,0,null,0,0,0,null,0,0,0,null,1,0,0,null,4,1,0,null,0,0,0,null,0,0,0,null,1,0,0,null,1,0,0,null,2,0,0,null,0,0,0,null,3,1,0,null,0,0,0,null,0,0,0,null,1,0,0,null,2,0,0,null,1,0,0,null,1,0,0,null,2,0,0,null,1,0,0,null,0,0,0,null,0,0,0,null,0,0,0,null,4,0,0,null,3,0,0,null,0,0,0,null,0,0,0,null,8,5,0,null,0,0,0,null,2,0,0,null,3,0,0,null,0,0,0,null,0,0,0,null,3,1,0,null,1,0,0,null,1,0,0,null,0,0,0,null,2,0,0,null,1,0,0,null,4,1,0,null,0,0,0,null,3,0,0,null,1,0,0,null,4,0,0,null,1,0,0,null,4,1,0,null,3,2,0,null,5,1,0,null,0,0,0,null,0,0,0,null,3,0,0,null,2,0,0,null,1,0,0,null,1,0,0,null,8,4,0,null,null,null,null,null,null,null,null,null,null,null,null,null,null,null,null,null,2,0,0,null,5,0,0,null,1,0,0,null,0,0,0,null,0,0,0]
[-12,null,6,4,0,null,0,0,0,null,0,0,0,null,1,0,0,null,5,2,0,null,0,0,0,null,1,0,0,null,2,0,0,null,1,0,0,null,3,0,0,null,0,0,0,null,4,1,0,null,1,0,0,null,0,0,0,null,1,1,0,null,2,0,0,null,2,0,0,null,2,1,0,null,3,1,0,null,2,0,0,null,1,0,0,null,0,0,0,null,1,0,0,null,3,0,0,null,4,1,0,null,0,0,0,null,0,0,0,null,8,6,0,null,1,0,0,null,4,0,0,null,2,1,0,null,0,0,0,null,1,0,0,null,2,1,0,null,1,0,0,null,2,1,0,null,1,0,0,null,3,1,0,null,2,0,0,null,3,1,0,null,1,0,0,null,3,1,0,null,2,0,0,null,2,2,0,null,0,0,0,null,4,0,0,null,4,1,0,null,7,3,0,null,0,0,0,null,1,0,0,null,4,0,0,null,3,0,0,null,1,0,0,null,1,0,0,null,6,4,0,null,null,null,null,null,null,null,null,null,null,null,null,null,null,null,null,null,2,0,0,null,3,0,0,null,2,0,0,null,1,0,0,null,0,0,0]
[-11,null,8,2,0,null,0,0,0,null,0,0,0,null,1,0,0,null,6,4,0,null,0,0,0,null,1,0,0,null,2,1,0,null,3,1,0,null,2,1,0,null,0,0,0,null,3,1,0,null,0,0,0,null,2,0,0,null,2,1,0,null,3,0,0,null,2,0,0,null,3,1,0,null,3,0,0,null,2,0,0,null,1,0,0,null,1,0,0,null,2,0,0,null,4,1,0,null,4,1,0,null,1,0,0,null,0,0,0,null,8,6,1,null,1,0,0,null,2,1,0,null,4,1,0,null,0,0,0,null,1,0,0,null,3,1,0,null,2,1,0,null,3,1,0,null,1,0,0,null,3,1,0,null,3,0,0,null,5,2,0,null,1,0,0,null,2,2,0,null,3,0,0,null,5,2,0,null,2,0,0,null,4,1,0,null,6,2,0,null,7,3,0,null,0,0,0,null,1,0,0,null,4,1,0,null,3,0,0,null,2,0,0,null,3,0,0,null,7,4,1,null,null,null,null,null,null,null,null,null,null,null,null,null,null,null,null,null,3,1,0,null,4,1,0,null,2,0,0,null,0,0,0,null,1,0,0]
[-10,null,10,5,1,null,1,0,0,null,0,0,0,null,1,0,0,null,7,3,0,null,1,0,0,null,1,0,0,null,3,1,0,null,4,1,0,null,3,1,0,null,0,0,0,null,5,1,0,null,2,0,0,null,1,0,0,null,2,1,0,null,4,2,0,null,3,2,0,null,3,1,0,null,4,2,0,null,2,1,0,null,2,0,0,null,1,0,0,null,3,0,0,null,5,1,0,null,5,3,0,null,0,0,0,null,0,0,0,null,9,8,1,null,3,0,0,null,4,1,0,null,3,1,0,null,2,0,0,null,1,0,0,null,5,1,0,null,2,0,0,null,2,1,0,null,4,0,0,null,4,0,0,null,2,1,0,null,5,3,0,null,1,0,0,null,5,1,0,null,2,1,0,null,6,3,0,null,2,1,0,null,3,3,0,null,4,4,0,null,6,4,0,null,0,0,0,null,3,0,0,null,5,1,0,null,4,1,0,null,2,0,0,null,2,0,0,null,7,5,0,null,null,null,null,null,null,null,null,null,null,null,null,null,null,null,null,null,4,1,0,null,5,2,0,null,4,0,0,null,2,0,0,null,1,0,0]
[-9,null,11,6,1,null,1,0,0,null,0,0,0,null,3,1,0,null,6,3,1,null,1,0,0,null,1,0,0,null,5,1,0,null,4,3,1,null,4,1,0,null,1,0,0,null,5,2,1,null,2,0,0,null,1,0,0,null,5,1,1,null,4,1,0,null,3,1,0,null,4,2,1,null,5,3,0,null,3,1,0,null,2,1,0,null,1,0,0,null,3,0,0,null,6,2,0,null,7,2,0,null,1,0,0,null,0,0,0,null,7,7,2,null,5,1,0,null,6,2,0,null,4,2,0,null,2,0,0,null,3,1,0,null,5,3,0,null,3,1,0,null,4,2,0,null,4,1,0,null,5,2,0,null,4,1,0,null,7,3,0,null,1,1,0,null,5,4,0,null,3,1,0,null,5,3,0,null,2,1,0,null,5,3,0,null,7,3,0,null,8,6,0,null,0,0,0,null,3,0,0,null,4,2,0,null,6,3,0,null,1,0,0,null,4,1,0,null,9,7,1,null,null,null,null,null,null,null,null,null,null,null,null,null,null,null,null,null,5,1,1,null,5,4,0,null,4,1,0,null,2,0,0,null,3,0,0]
[-8,null,13,7,2,null,3,0,0,null,0,0,0,null,3,1,0,null,6,5,1,null,2,0,0,null,2,0,0,null,4,2,0,null,5,2,1,null,6,2,0,null,1,0,0,null,6,3,0,null,1,0,0,null,2,1,0,null,6,2,1,null,4,2,0,null,5,1,0,null,5,3,1,null,7,2,0,null,4,1,0,null,3,1,0,null,2,0,0,null,3,1,0,null,5,3,0,null,6,3,2,null,2,0,0,null,0,0,0,null,9,9,3,null,4,2,0,null,5,2,0,null,6,3,0,null,3,0,0,null,3,1,0,null,6,5,0,null,5,2,0,null,4,1,0,null,5,1,0,null,7,3,0,null,5,2,0,null,7,3,0,null,3,0,0,null,6,4,1,null,5,2,0,null,8,4,1,null,3,1,0,null,6,4,1,null,8,4,1,null,10,5,0,null,2,0,0,null,2,1,0,null,8,5,0,null,5,3,0,null,5,1,0,null,6,1,0,null,8,7,3,null,null,null,null,null,null,null,null,null,null,null,null,null,null,null,null,null,7,4,0,null,5,3,0,null,5,1,0,null,2,0,0,null,4,1,0]
[-7,null,10,7,4,null,4,1,0,null,0,0,0,null,4,2,0,null,9,5,1,null,2,1,0,null,3,2,0,null,6,3,0,null,7,6,2,null,6,2,0,null,2,0,0,null,8,3,1,null,3,1,0,null,2,0,0,null,8,4,2,null,5,3,0,null,4,1,0,null,6,3,0,null,6,4,0,null,5,2,0,null,4,2,0,null,2,0,0,null,5,1,0,null,7,6,1,null,9,6,1,null,3,0,0,null,1,0,0,null,10,8,3,null,6,4,1,null,7,2,0,null,5,3,0,null,3,1,0,null,3,2,0,null,7,3,1,null,5,1,0,null,7,3,0,null,4,2,0,null,8,3,1,null,5,4,0,null,9,5,1,null,4,2,0,null,9,5,1,null,5,3,0,null,8,5,2,null,4,3,1,null,7,4,1,null,8,4,1,null,12,6,0,null,2,0,0,null,4,2,0,null,9,5,0,null,8,4,1,null,5,2,0,null,8,2,0,null,9,8,3,null,null,null,null,null,null,null,null,null,null,null,null,null,null,null,null,null,8,5,2,null,9,5,2,null,6,3,0,null,6,1,0,null,4,2,0]
[-6,null,13,10,4,null,4,2,0,null,0,0,0,null,6,2,1,null,12,8,2,null,3,2,0,null,4,1,0,null,5,4,1,null,8,3,3,null,6,3,1,null,3,0,0,null,9,5,1,null,4,2,0,null,5,2,0,null,10,6,2,null,8,4,2,null,4,2,0,null,9,5,3,null,8,4,2,null,5,2,1,null,4,2,1,null,4,1,0,null,7,3,0,null,10,6,1,null,10,5,3,null,4,1,0,null,1,0,0,null,12,9,5,null,6,5,2,null,9,5,1,null,7,6,1,null,4,3,0,null,5,3,1,null,10,6,1,null,7,4,0,null,5,3,1,null,6,3,0,null,7,5,0,null,5,3,0,null,9,5,1,null,4,2,0,null,9,6,3,null,3,4,0,null,12,7,2,null,6,3,0,null,8,6,2,null,11,5,1,null,10,10,0,null,3,0,0,null,5,3,0,null,10,5,2,null,10,4,2,null,6,2,0,null,10,4,1,null,11,8,3,null,null,null,null,null,null,null,null,null,null,null,null,null,null,null,null,null,9,7,3,null,10,5,1,null,8,4,0,null,6,2,0,null,5,4,1]
[-5,null,13,13,6,null,8,5,1,null,1,0,0,null,7,4,1,null,14,8,3,null,4,3,1,null,4,1,0,null,9,4,2,null,11,6,4,null,10,4,1,null,6,0,0,null,11,6,2,null,4,2,0,null,4,2,0,null,10,9,4,null,9,3,2,null,9,3,2,null,11,6,4,null,9,5,1,null,10,3,0,null,6,3,0,null,5,3,0,null,9,5,1,null,11,5,3,null,12,6,3,null,9,3,0,null,3,0,0,null,13,14,4,null,9,5,4,null,10,5,2,null,10,5,2,null,4,4,0,null,6,4,1,null,8,6,2,null,10,5,2,null,7,6,2,null,9,5,0,null,11,6,2,null,7,5,2,null,13,5,1,null,6,4,1,null,13,7,2,null,7,4,1,null,12,7,4,null,6,4,2,null,9,5,3,null,11,6,3,null,11,13,0,null,6,0,0,null,5,4,1,null,11,6,1,null,12,8,3,null,9,4,0,null,13,5,1,null,12,10,5,null,null,null,null,null,null,null,null,null,null,null,null,null,null,null,null,null,10,7,4,null,11,6,3,null,12,6,1,null,9,3,0,null,7,4,2]
[-4,null,14,13,6,null,8,5,3,null,1,0,0,null,8,5,2,null,13,11,4,null,6,3,2,null,6,3,2,null,9,7,4,null,12,8,5,null,12,6,2,null,8,0,0,null,12,8,3,null,7,3,1,null,7,3,1,null,15,10,8,null,10,7,2,null,11,6,1,null,10,9,4,null,12,5,4,null,11,6,3,null,8,3,3,null,6,3,0,null,12,5,2,null,11,7,3,null,12,9,5,null,12,3,1,null,4,2,0,null,15,11,7,null,10,6,4,null,12,5,2,null,11,6,2,null,8,4,1,null,7,5,3,null,11,7,3,null,11,4,3,null,9,5,3,null,11,4,1,null,11,7,2,null,10,5,2,null,11,10,4,null,7,4,2,null,12,8,4,null,9,4,3,null,10,10,4,null,9,7,3,null,12,7,3,null,13,9,3,null,13,10,0,null,8,2,0,null,8,5,2,null,14,7,3,null,14,8,4,null,12,4,1,null,13,6,2,null,10,11,5,null,null,null,null,null,null,null,null,null,null,null,null,null,null,null,null,null,13,8,6,null,13,7,5,null,14,6,2,null,12,6,2,null,9,7,2]
[-3,null,15,13,9,null,11,7,4,null,4,0,0,null,13,6,3,null,14,9,5,null,7,5,2,null,9,4,1,null,13,5,4,null,14,11,5,null,13,7,3,null,8,2,0,null,12,7,4,null,12,4,2,null,9,5,2,null,15,13,9,null,14,6,4,null,11,5,3,null,13,9,7,null,12,8,4,null,13,5,2,null,12,6,3,null,10,4,3,null,17,7,3,null,12,9,4,null,13,12,7,null,13,7,3,null,7,2,0,null,13,10,10,null,12,6,5,null,14,6,2,null,14,8,4,null,10,5,3,null,10,4,3,null,15,8,5,null,13,6,2,null,13,6,4,null,11,7,2,null,14,10,3,null,11,7,2,null,12,11,3,null,9,8,4,null,16,11,6,null,9,6,2,null,15,13,5,null,9,5,5,null,14,11,5,null,14,12,3,null,13,11,0,null,13,2,0,null,10,5,2,null,14,9,4,null,14,10,3,null,13,7,2,null,15,9,3,null,14,12,8,null,null,null,null,null,null,null,null,null,null,null,null,null,null,null,null,null,16,11,6,null,12,11,4,null,13,8,3,null,13,6,4,null,11,4,6]
[-2,null,19,15,10,null,12,7,5,null,5,1,0,null,15,7,3,null,17,14,5,null,7,5,4,null,13,5,3,null,14,9,6,null,14,12,7,null,16,10,3,null,12,2,0,null,14,8,6,null,14,5,3,null,14,6,3,null,17,12,10,null,16,9,6,null,14,7,4,null,14,11,8,null,15,10,5,null,13,8,4,null,13,7,3,null,12,6,2,null,14,7,6,null,15,9,6,null,16,12,6,null,15,9,5,null,9,5,2,null,17,12,10,null,14,11,5,null,14,7,5,null,17,12,4,null,10,6,4,null,11,8,4,null,16,10,7,null,16,9,5,null,15,7,4,null,14,9,3,null,15,12,5,null,16,9,5,null,16,11,3,null,12,6,4,null,18,12,7,null,15,7,4,null,13,12,7,null,13,8,6,null,16,12,6,null,15,12,6,null,15,14,0,null,17,6,0,null,11,6,4,null,14,12,6,null,15,13,7,null,15,8,3,null,16,13,5,null,15,12,9,null,null,null,null,null,null,null,null,null,null,null,null,null,null,null,null,null,16,10,7,null,14,11,7,null,16,10,4,null,15,8,4,null,11,8,6]
[-1,null,20,15,11,null,15,8,5,null,11,2,0,null,17,9,4,null,19,13,8,null,11,7,4,null,14,7,2,null,19,9,7,null,14,11,9,null,16,9,7,null,12,3,0,null,14,11,3,null,16,7,3,null,16,8,4,null,18,16,11,null,20,11,7,null,19,10,4,null,16,12,9,null,17,12,7,null,17,11,7,null,13,9,5,null,12,7,5,null,15,10,5,null,15,13,9,null,16,13,9,null,15,8,7,null,12,7,3,null,16,11,13,null,12,11,8,null,13,10,4,null,19,14,7,null,15,8,4,null,15,8,6,null,18,13,7,null,19,10,4,null,15,11,5,null,16,10,4,null,15,12,10,null,17,12,6,null,15,12,7,null,15,9,6,null,22,13,9,null,16,9,5,null,15,12,9,null,15,9,6,null,15,13,8,null,16,11,7,null,17,14,0,null,18,8,2,null,15,9,5,null,15,13,7,null,19,14,9,null,18,9,6,null,17,15,6,null,18,13,10,null,null,null,null,null,null,null,null,null,null,null,null,null,null,null,null,null,16,15,10,null,16,14,8,null,17,13,8,null,17,9,7,null,13,9,5]
[0,null,21,14,13,null,18,12,7,null,16,5,1,null,19,12,5,null,20,15,10,null,11,8,6,null,17,7,5,null,20,12,7,null,18,14,9,null,16,12,8,null,14,6,0,null,16,14,7,null,13,8,5,null,15,9,5,null,21,19,14,null,21,14,7,null,20,11,7,null,19,15,11,null,20,13,6,null,20,11,6,null,17,11,6,null,19,9,6,null,19,15,7,null,19,15,9,null,19,13,9,null,19,11,5,null,15,8,5,null,19,12,13,null,16,12,9,null,18,13,7,null,20,17,8,null,16,10,7,null,15,11,6,null,21,15,7,null,18,14,5,null,19,11,7,null,19,14,6,null,16,15,7,null,21,14,8,null,16,12,7,null,19,10,7,null,20,15,9,null,18,13,6,null,21,13,12,null,17,11,7,null,20,15,12,null,15,15,9,null,18,13,0,null,20,10,2,null,11,10,6,null,18,16,8,null,18,15,10,null,17,12,6,null,19,18,8,null,21,12,13,null,null,null,null,null,null,null,null,null,null,null,null,null,null,null,null,null,19,16,12,null,19,13,10,null,18,14,7,null,17,13,5,null,17,12,7]
[1,null,18,14,12,null,18,13,8,null,19,8,2,null,16,16,6,null,15,16,13,null,13,10,7,null,15,11,6,null,19,16,9,null,14,13,8,null,16,15,8,null,12,9,1,null,16,12,6,null,14,12,6,null,16,11,8,null,17,16,14,null,21,14,10,null,19,14,7,null,20,13,12,null,18,14,10,null,19,14,9,null,18,12,7,null,16,11,6,null,17,14,8,null,22,16,10,null,17,15,12,null,18,17,7,null,16,11,7,null,18,13,14,null,16,12,9,null,16,13,5,null,19,14,12,null,19,15,6,null,18,12,7,null,18,16,12,null,16,16,6,null,15,14,8,null,18,14,8,null,14,15,11,null,20,16,10,null,14,14,9,null,16,15,8,null,17,16,10,null,20,15,8,null,16,14,11,null,18,15,8,null,18,15,12,null,13,12,8,null,18,15,0,null,16,16,5,null,18,13,8,null,21,14,9,null,14,14,11,null,17,16,6,null,19,13,10,null,17,13,12,null,null,null,null,null,null,null,null,null,null,null,null,null,null,null,null,null,17,15,11,null,19,16,11,null,19,17,10,null,17,14,7,null,16,12,8]
[2,null,15,15,13,null,15,14,9,null,18,13,3,null,13,16,10,null,17,14,12,null,16,12,8,null,17,12,6,null,16,13,9,null,14,10,12,null,16,15,8,null,12,9,2,null,15,14,7,null,14,12,8,null,14,13,7,null,17,16,16,null,18,13,10,null,19,13,13,null,18,15,12,null,19,17,9,null,17,14,11,null,18,11,9,null,16,14,7,null,15,16,9,null,21,13,11,null,16,14,11,null,15,14,8,null,18,13,8,null,16,15,14,null,18,15,9,null,15,13,10,null,17,15,13,null,17,15,9,null,12,13,10,null,17,15,11,null,11,15,10,null,16,14,9,null,13,15,9,null,12,15,11,null,13,17,10,null,13,14,11,null,16,18,9,null,16,15,13,null,16,13,10,null,16,15,11,null,16,15,10,null,15,16,12,null,14,13,12,null,17,14,0,null,17,18,7,null,14,13,9,null,18,14,11,null,15,14,10,null,19,13,7,null,14,16,16,null,17,16,15,null,null,null,null,null,null,null,null,null,null,null,null,null,null,null,null,null,16,16,13,null,17,14,11,null,14,15,10,null,14,13,8,null,16,13,8]
[3,null,15,15,11,null,14,17,11,null,17,15,6,null,12,13,8,null,13,14,10,null,16,13,9,null,16,14,8,null,15,13,11,null,16,12,12,null,12,16,8,null,15,12,2,null,16,13,10,null,17,13,8,null,17,14,8,null,18,16,15,null,16,15,12,null,18,16,9,null,17,15,11,null,18,13,12,null,18,16,9,null,15,16,9,null,15,13,8,null,18,15,11,null,15,15,13,null,19,14,10,null,15,16,11,null,18,15,9,null,17,15,11,null,14,11,12,null,14,13,9,null,14,14,13,null,14,16,11,null,15,13,8,null,15,14,12,null,12,13,12,null,15,14,9,null,13,16,10,null,10,10,13,null,15,15,12,null,12,12,11,null,16,14,12,null,13,15,11,null,15,15,9,null,18,15,10,null,14,13,11,null,12,13,14,null,15,13,12,null,16,14,0,null,17,14,9,null,15,12,9,null,18,14,12,null,17,13,10,null,19,15,10,null,14,15,14,null,13,11,12,null,null,null,null,null,null,null,null,null,null,null,null,null,null,null,null,null,19,16,14,null,15,14,12,null,18,13,12,null,17,16,10,null,16,14,11]
[4,null,16,17,12,null,17,13,13,null,16,16,7,null,11,11,10,null,12,13,16,null,15,13,10,null,18,13,9,null,16,15,11,null,16,15,9,null,12,13,9,null,15,15,4,null,18,15,9,null,17,13,8,null,18,15,11,null,16,15,12,null,16,16,12,null,14,16,10,null,17,14,14,null,15,12,13,null,18,13,13,null,17,15,11,null,18,14,9,null,13,13,13,null,19,16,12,null,16,14,10,null,16,16,14,null,14,17,10,null,16,14,11,null,14,14,12,null,14,10,11,null,14,13,14,null,16,14,12,null,14,12,10,null,14,14,13,null,13,11,11,null,14,12,11,null,15,12,11,null,14,10,11,null,14,11,14,null,14,10,12,null,16,13,13,null,14,14,12,null,14,14,10,null,13,15,12,null,15,13,12,null,14,12,13,null,12,11,12,null,18,14,0,null,15,16,10,null,11,14,10,null,14,14,13,null,19,14,14,null,18,15,11,null,15,12,13,null,18,10,13,null,null,null,null,null,null,null,null,null,null,null,null,null,null,null,null,null,15,15,14,null,16,14,14,null,16,13,11,null,18,15,11,null,16,12,11]
[5,null,18,16,13,null,17,12,12,null,17,17,11,null,14,15,10,null,12,11,11,null,13,12,11,null,16,15,11,null,13,13,13,null,15,14,10,null,16,12,12,null,15,16,6,null,15,14,11,null,18,16,12,null,18,15,12,null,20,15,13,null,17,12,11,null,20,14,13,null,17,15,12,null,14,13,11,null,13,15,12,null,19,14,12,null,17,15,13,null,19,12,11,null,16,15,13,null,16,13,13,null,16,12,12,null,16,14,15,null,18,14,11,null,13,14,9,null,15,13,11,null,13,11,12,null,14,14,13,null,15,13,10,null,16,12,12,null,15,13,9,null,14,12,12,null,13,12,10,null,13,9,12,null,15,13,13,null,12,12,12,null,11,13,13,null,13,15,11,null,15,14,12,null,19,14,10,null,14,12,13,null,13,10,11,null,14,11,10,null,17,14,0,null,15,13,12,null,20,13,11,null,16,13,13,null,17,13,13,null,16,14,12,null,16,14,12,null,17,13,9,null,null,null,null,null,null,null,null,null,null,null,null,null,null,null,null,null,22,14,13,null,14,13,10,null,17,13,13,null,20,12,13,null,16,14,12]
[6,null,18,15,14,null,16,14,10,null,16,13,11,null,16,12,13,null,13,13,11,null,14,14,11,null,21,14,10,null,17,14,12,null,18,16,9,null,16,11,11,null,15,16,10,null,20,15,12,null,18,14,11,null,20,15,13,null,19,16,14,null,17,17,12,null,15,15,12,null,17,12,10,null,15,15,10,null,17,14,14,null,16,13,13,null,18,13,11,null,15,13,11,null,17,15,14,null,16,14,11,null,16,12,11,null,18,15,11,null,15,11,13,null,19,13,11,null,16,9,10,null,11,15,10,null,17,12,12,null,13,13,9,null,13,14,9,null,15,14,11,null,16,14,11,null,16,10,12,null,13,11,9,null,15,11,12,null,13,11,11,null,17,13,11,null,13,15,11,null,17,14,14,null,16,16,11,null,17,14,11,null,15,12,10,null,13,13,11,null,16,16,0,null,16,16,11,null,15,11,10,null,15,13,13,null,18,14,12,null,15,14,11,null,13,15,15,null,19,13,10,null,null,null,null,null,null,null,null,null,null,null,null,null,null,null,null,null,19,17,16,null,17,16,15,null,16,14,13,null,15,11,13,null,17,16,11]
[7,null,16,14,13,null,17,15,13,null,14,17,14,null,15,11,11,null,15,13,10,null,14,12,11,null,17,14,14,null,14,14,10,null,17,14,11,null,15,13,12,null,18,17,10,null,16,14,14,null,19,13,13,null,20,14,13,null,20,16,14,null,13,13,9,null,18,13,14,null,16,13,13,null,16,15,12,null,18,13,11,null,17,17,14,null,17,14,11,null,16,15,12,null,17,15,11,null,20,15,12,null,14,15,13,null,17,14,15,null,10,14,11,null,18,15,11,null,17,10,10,null,16,12,11,null,16,14,10,null,14,14,13,null,14,11,10,null,16,10,10,null,15,11,10,null,16,12,11,null,16,11,8,null,14,11,10,null,14,12,11,null,15,13,12,null,14,14,11,null,12,12,10,null,15,16,16,null,15,12,9,null,16,11,9,null,11,9,10,null,18,16,0,null,19,13,13,null,12,12,10,null,17,14,14,null,17,16,10,null,17,17,13,null,15,14,11,null,16,11,10,null,null,null,null,null,null,null,null,null,null,null,null,null,null,null,null,null,18,17,14,null,16,16,11,null,18,12,12,null,16,17,12,null,17,14,12]
[8,null,16,15,12,null,18,14,12,null,15,15,13,null,15,12,11,null,15,13,9,null,14,12,12,null,18,14,11,null,15,11,9,null,19,16,15,null,17,11,12,null,15,16,11,null,17,15,14,null,17,17,15,null,20,14,12,null,19,18,14,null,16,12,11,null,17,14,12,null,19,15,10,null,14,13,10,null,16,15,10,null,17,14,11,null,16,13,12,null,17,14,11,null,22,15,17,null,16,15,13,null,16,13,9,null,15,16,15,null,10,17,12,null,16,14,13,null,14,13,10,null,14,13,7,null,16,14,12,null,15,13,8,null,14,12,10,null,11,10,11,null,16,11,9,null,16,11,12,null,12,10,9,null,14,12,10,null,15,9,8,null,14,13,9,null,17,14,12,null,15,13,11,null,15,16,12,null,14,13,10,null,13,13,7,null,16,12,10,null,18,15,0,null,16,14,13,null,15,13,11,null,17,15,9,null,17,17,12,null,15,15,13,null,19,12,12,null,15,15,11,null,null,null,null,null,null,null,null,null,null,null,null,null,null,null,null,null,18,18,13,null,14,13,16,null,14,14,13,null,18,15,11,null,18,15,12]
[9,null,15,17,13,null,16,15,11,null,16,12,14,null,14,10,10,null,17,14,10,null,13,13,10,null,15,15,11,null,15,12,11,null,15,15,13,null,14,13,12,null,15,15,14,null,17,15,15,null,18,13,12,null,20,18,15,null,20,18,15,null,17,14,12,null,15,15,10,null,18,14,13,null,16,15,12,null,15,12,13,null,18,13,11,null,16,16,11,null,15,13,12,null,18,19,12,null,18,18,13,null,16,14,10,null,17,15,12,null,6,16,11,null,16,15,14,null,15,13,9,null,16,11,10,null,17,14,10,null,15,12,11,null,15,12,13,null,13,12,12,null,16,13,10,null,15,13,9,null,16,11,9,null,15,13,7,null,14,11,9,null,15,11,11,null,18,12,11,null,16,12,10,null,19,14,15,null,14,11,9,null,14,13,9,null,14,15,9,null,17,17,0,null,15,16,15,null,16,12,11,null,18,15,12,null,18,17,12,null,16,13,13,null,18,12,10,null,14,15,10,null,null,null,null,null,null,null,null,null,null,null,null,null,null,null,null,null,18,18,14,null,15,15,11,null,20,15,9,null,16,15,13,null,18,14,14]
[10,null,11,17,15,null,16,13,13,null,15,15,13,null,13,11,11,null,15,11,10,null,17,13,10,null,17,14,12,null,15,15,11,null,19,17,14,null,18,12,10,null,17,12,13,null,19,15,13,null,17,17,12,null,18,13,12,null,15,17,13,null,15,13,10,null,18,12,13,null,17,17,11,null,18,17,13,null,18,15,11,null,16,14,12,null,17,15,12,null,16,13,13,null,15,16,11,null,18,16,12,null,14,14,12,null,18,14,14,null,2,19,13,null,20,15,14,null,19,11,9,null,17,15,9,null,14,13,14,null,15,10,11,null,16,13,10,null,16,11,9,null,16,12,9,null,13,12,10,null,13,12,10,null,15,13,10,null,14,11,7,null,14,11,11,null,18,14,13,null,13,12,9,null,19,16,13,null,14,13,12,null,17,15,9,null,16,14,9,null,16,16,0,null,18,14,13,null,20,12,10,null,17,18,12,null,19,16,13,null,15,15,14,null,17,13,12,null,9,16,10,null,null,null,null,null,null,null,null,null,null,null,null,null,null,null,null,null,19,18,15,null,18,17,12,null,19,15,12,null,16,13,11,null,17,15,12]
[11,null,6,15,16,null,19,13,12,null,12,14,14,null,16,14,10,null,15,13,10,null,15,11,11,null,14,15,11,null,17,14,13,null,18,18,12,null,17,18,10,null,17,15,16,null,17,15,14,null,18,11,12,null,21,17,11,null,14,18,15,null,18,16,14,null,18,14,9,null,19,14,11,null,17,14,12,null,18,13,12,null,19,13,12,null,16,14,11,null,19,15,13,null,13,18,12,null,17,17,13,null,18,13,14,null,17,13,13,null,2,15,11,null,16,18,13,null,18,13,9,null,17,12,9,null,17,15,13,null,14,11,11,null,15,14,10,null,17,16,9,null,13,13,11,null,15,13,8,null,15,13,8,null,15,15,10,null,16,12,11,null,15,12,11,null,19,14,11,null,15,13,10,null,14,16,14,null,17,12,10,null,19,12,10,null,16,13,10,null,12,18,0,null,22,14,13,null,15,14,12,null,16,16,11,null,20,17,13,null,19,15,11,null,18,14,11,null,5,18,12,null,null,null,null,null,null,null,null,null,null,null,null,null,null,null,null,null,14,17,17,null,18,16,12,null,16,19,11,null,18,13,13,null,16,15,14]
[12,null,3,15,16,null,15,17,12,null,15,13,13,null,15,13,10,null,16,13,11,null,14,12,12,null,18,13,11,null,16,15,12,null,17,16,15,null,20,13,9,null,15,15,15,null,18,16,11,null,17,16,11,null,19,18,11,null,12,15,15,null,15,17,12,null,16,16,13,null,14,16,12,null,16,16,12,null,15,16,11,null,18,15,12,null,18,13,14,null,19,16,12,null,12,17,15,null,14,18,12,null,16,13,12,null,15,14,11,null,0,15,15,null,19,17,11,null,20,14,10,null,18,12,10,null,16,14,11,null,17,14,11,null,19,12,9,null,17,13,9,null,15,14,10,null,19,17,9,null,14,13,9,null,18,13,9,null,18,15,9,null,16,13,9,null,15,15,13,null,17,15,12,null,13,17,14,null,15,13,10,null,18,14,10,null,17,11,10,null,6,16,0,null,17,15,12,null,17,14,11,null,16,15,10,null,16,17,15,null,16,16,13,null,20,15,12,null,2,14,10,null,null,null,null,null,null,null,null,null,null,null,null,null,null,null,null,null,13,16,16,null,16,16,14,null,19,16,12,null,18,15,13,null,19,18,12]
[13,null,0,14,15,null,19,17,11,null,17,14,13,null,17,16,11,null,11,15,13,null,15,13,9,null,17,15,14,null,16,16,10,null,16,16,17,null,18,13,12,null,19,13,13,null,12,15,13,null,20,16,14,null,17,17,12,null,9,16,17,null,15,16,10,null,14,16,11,null,13,15,11,null,14,15,12,null,14,15,10,null,17,15,12,null,19,15,11,null,15,16,9,null,10,17,16,null,10,16,13,null,18,16,13,null,21,16,13,null,0,17,14,null,18,17,14,null,18,15,8,null,19,15,11,null,17,17,11,null,14,15,11,null,13,13,9,null,14,14,10,null,18,13,9,null,19,15,9,null,18,13,10,null,18,15,10,null,15,14,11,null,18,14,10,null,12,17,12,null,19,15,12,null,13,17,19,null,17,14,10,null,16,16,10,null,15,13,10,null,4,15,0,null,19,13,11,null,11,16,8,null,12,17,13,null,10,15,14,null,16,16,13,null,16,17,9,null,0,16,14,null,null,null,null,null,null,null,null,null,null,null,null,null,null,null,null,null,8,18,18,null,14,16,17,null,16,15,14,null,17,17,9,null,21,16,15]
[14,null,0,11,12,null,18,16,12,null,20,14,11,null,17,13,11,null,7,17,11,null,16,12,11,null,17,17,11,null,15,16,11,null,11,16,13,null,18,15,13,null,18,13,15,null,9,18,13,null,14,15,12,null,16,16,14,null,5,13,13,null,12,15,12,null,11,16,10,null,10,16,13,null,11,18,11,null,13,16,12,null,15,16,11,null,17,19,13,null,13,16,12,null,6,17,16,null,7,19,16,null,18,18,10,null,17,14,13,null,0,12,12,null,13,15,15,null,11,17,9,null,13,16,12,null,18,15,12,null,18,12,10,null,12,15,10,null,18,13,10,null,14,13,9,null,17,14,12,null,17,13,8,null,17,14,10,null,17,14,9,null,17,15,8,null,8,16,14,null,16,15,11,null,6,16,13,null,19,14,9,null,16,16,9,null,15,16,11,null,2,13,0,null,19,17,14,null,20,18,10,null,7,16,14,null,8,17,16,null,15,15,13,null,12,17,13,null,0,13,13,null,null,null,null,null,null,null,null,null,null,null,null,null,null,null,null,null,8,14,16,null,10,19,15,null,11,16,13,null,14,16,11,null,15,17,12]
[15,null,0,12,15,null,15,16,12,null,18,11,14,null,16,14,8,null,2,15,11,null,17,14,10,null,16,15,11,null,13,14,10,null,8,17,17,null,11,17,11,null,19,13,15,null,5,16,12,null,15,17,11,null,14,17,13,null,6,11,13,null,8,17,11,null,9,15,12,null,6,16,15,null,8,16,14,null,11,15,10,null,14,18,11,null,16,18,13,null,13,16,12,null,4,15,16,null,3,13,16,null,15,15,10,null,19,16,10,null,0,9,16,null,13,17,18,null,10,16,11,null,10,16,8,null,17,16,12,null,16,14,9,null,9,16,11,null,17,12,8,null,14,11,12,null,15,15,10,null,19,14,10,null,14,14,10,null,11,16,11,null,17,12,10,null,4,15,15,null,16,14,10,null,6,12,15,null,18,13,9,null,11,16,11,null,9,14,11,null,1,13,0,null,14,18,12,null,22,15,14,null,4,15,12,null,4,17,17,null,12,18,13,null,7,17,13,null,0,15,13,null,null,null,null,null,null,null,null,null,null,null,null,null,null,null,null,null,5,13,15,null,5,14,15,null,5,18,13,null,11,16,12,null,14,18,12]
[16,null,0,6,13,null,11,16,12,null,20,13,12,null,17,14,11,null,0,14,15,null,18,15,9,null,15,15,11,null,8,16,12,null,6,12,15,null,8,17,12,null,20,14,12,null,3,16,13,null,12,15,11,null,9,20,12,null,3,9,16,null,4,16,12,null,7,15,10,null,5,15,14,null,4,14,16,null,7,16,11,null,10,15,10,null,14,16,12,null,8,16,12,null,0,12,16,null,1,12,16,null,14,17,13,null,17,17,11,null,0,5,16,null,9,17,15,null,5,19,11,null,5,14,13,null,13,15,15,null,19,13,10,null,4,15,13,null,13,14,11,null,12,13,7,null,13,15,12,null,13,12,8,null,11,19,11,null,8,14,9,null,16,15,11,null,1,15,16,null,12,16,11,null,3,11,15,null,14,15,11,null,4,16,11,null,4,16,11,null,0,9,0,null,12,17,14,null,16,19,15,null,1,15,13,null,1,12,15,null,7,15,12,null,3,16,15,null,0,12,13,null,null,null,null,null,null,null,null,null,null,null,null,null,null,null,null,null,3,11,15,null,3,13,14,null,3,18,14,null,11,16,12,null,10,15,16]
[17,null,0,5,15,null,10,17,14,null,17,18,10,null,13,14,11,null,0,13,12,null,16,12,11,null,9,18,11,null,5,16,15,null,4,11,14,null,2,14,12,null,17,17,12,null,1,16,15,null,9,18,11,null,5,16,11,null,1,8,14,null,2,13,16,null,4,16,12,null,1,13,13,null,1,15,16,null,5,17,14,null,8,14,13,null,10,16,10,null,5,15,15,null,0,11,15,null,0,14,14,null,9,15,14,null,13,18,16,null,0,1,14,null,6,14,16,null,2,16,11,null,2,16,12,null,14,15,15,null,15,13,12,null,3,14,14,null,10,17,10,null,8,14,10,null,8,18,12,null,8,16,11,null,8,15,13,null,3,14,9,null,14,16,10,null,1,14,13,null,8,16,11,null,2,11,12,null,10,17,11,null,2,14,15,null,2,15,13,null,0,6,0,null,6,18,13,null,9,16,14,null,0,13,16,null,1,12,13,null,4,17,13,null,1,17,14,null,0,9,12,null,null,null,null,null,null,null,null,null,null,null,null,null,null,null,null,null,2,8,13,null,1,12,17,null,1,13,14,null,5,16,13,null,7,17,16]
[18,null,0,3,11,null,6,16,16,null,18,16,13,null,8,17,13,null,0,12,12,null,15,16,11,null,7,17,10,null,3,14,15,null,3,10,15,null,1,15,13,null,12,16,12,null,0,14,15,null,6,16,13,null,3,17,15,null,2,4,11,null,0,14,15,null,2,15,15,null,1,10,14,null,0,10,13,null,2,14,16,null,3,16,13,null,8,17,14,null,2,15,13,null,0,10,14,null,0,9,16,null,5,17,15,null,11,15,12,null,0,0,13,null,4,12,14,null,1,16,13,null,1,12,14,null,8,16,15,null,10,19,11,null,1,13,15,null,3,15,13,null,4,16,11,null,3,14,12,null,3,14,12,null,3,14,14,null,1,15,13,null,10,17,14,null,0,10,14,null,6,15,14,null,0,8,14,null,8,14,12,null,1,14,14,null,0,16,14,null,0,5,0,null,3,17,13,null,8,17,12,null,0,12,16,null,0,9,14,null,1,15,16,null,0,13,13,null,0,5,14,null,null,null,null,null,null,null,null,null,null,null,null,null,null,null,null,null,1,6,14,null,0,11,14,null,0,14,15,null,1,16,14,null,5,12,15]
[19,null,0,2,13,null,3,10,14,null,12,18,13,null,5,15,12,null,0,9,12,null,13,16,13,null,4,16,12,null,0,12,13,null,2,9,16,null,0,16,14,null,7,18,10,null,0,9,14,null,4,16,15,null,2,14,16,null,0,5,9,null,0,11,13,null,0,14,15,null,0,9,12,null,0,11,14,null,1,13,13,null,3,16,16,null,4,16,16,null,0,14,15,null,0,6,13,null,0,5,13,null,2,13,15,null,7,17,14,null,0,0,12,null,2,10,15,null,0,15,18,null,0,13,13,null,5,13,14,null,8,14,13,null,0,10,12,null,2,16,12,null,2,14,14,null,2,13,15,null,1,15,14,null,1,12,13,null,0,15,14,null,6,14,12,null,0,6,14,null,2,13,14,null,0,6,16,null,4,14,12,null,0,12,13,null,0,13,13,null,0,2,0,null,0,18,12,null,6,15,15,null,0,8,15,null,0,7,15,null,1,13,13,null,0,11,15,null,0,3,13,null,null,null,null,null,null,null,null,null,null,null,null,null,null,null,null,null,0,5,12,null,0,8,13,null,0,10,14,null,1,12,15,null,2,12,15]
[20,null,0,0,8,null,0,12,13,null,8,16,12,null,2,15,14,null,0,4,13,null,13,15,12,null,1,14,15,null,0,11,14,null,0,6,13,null,0,12,14,null,3,13,13,null,0,9,16,null,1,14,14,null,0,10,13,null,0,4,9,null,0,10,12,null,0,11,13,null,0,8,13,null,0,8,13,null,0,11,14,null,0,12,14,null,2,12,17,null,0,11,14,null,0,5,14,null,0,4,11,null,0,13,14,null,4,15,16,null,0,0,11,null,2,9,15,null,0,14,14,null,0,10,13,null,2,13,15,null,4,14,14,null,0,11,14,null,1,14,13,null,1,14,11,null,1,14,15,null,0,16,12,null,0,13,14,null,0,13,15,null,2,13,14,null,0,4,14,null,1,13,15,null,0,4,14,null,1,12,13,null,0,8,13,null,0,10,15,null,0,1,0,null,0,16,14,null,4,13,16,null,0,5,14,null,0,5,11,null,0,9,14,null,0,10,16,null,0,0,12,null,null,null,null,null,null,null,null,null,null,null,null,null,null,null,null,null,0,4,10,null,0,4,12,null,0,9,14,null,0,13,13,null,3,11,14]
[21,null,0,0,9,null,0,10,14,null,5,15,13,null,1,13,14,null,0,3,12,null,6,13,14,null,1,12,15,null,0,9,13,null,1,6,11,null,0,12,15,null,1,15,15,null,0,5,13,null,1,12,15,null,0,8,16,null,0,2,7,null,0,9,15,null,0,8,13,null,0,4,10,null,0,7,12,null,0,8,13,null,0,8,13,null,0,11,13,null,0,9,15,null,0,3,10,null,0,3,13,null,0,11,13,null,4,11,14,null,0,0,12,null,0,6,11,null,0,13,14,null,0,8,12,null,0,11,13,null,2,13,13,null,0,8,12,null,0,14,16,null,1,14,13,null,0,12,15,null,0,11,14,null,0,9,13,null,0,10,15,null,1,12,15,null,0,3,12,null,0,9,11,null,0,2,13,null,1,14,13,null,0,6,12,null,0,7,13,null,0,0,0,null,0,11,15,null,1,12,13,null,0,4,13,null,0,4,12,null,0,8,14,null,0,4,13,null,0,0,12,null,null,null,null,null,null,null,null,null,null,null,null,null,null,null,null,null,0,2,9,null,0,3,13,null,0,5,13,null,0,8,14,null,0,7,15]
[22,null,0,0,10,null,0,7,12,null,2,16,14,null,0,12,14,null,0,1,13,null,4,12,13,null,0,9,14,null,0,8,16,null,0,4,10,null,0,8,14,null,1,14,14,null,0,2,13,null,0,8,14,null,0,6,14,null,0,1,8,null,0,4,14,null,0,7,11,null,0,4,11,null,0,5,16,null,0,7,13,null,0,8,12,null,0,9,15,null,0,6,13,null,0,2,11,null,0,1,11,null,0,7,14,null,1,11,14,null,0,0,8,null,0,4,12,null,0,9,14,null,0,4,14,null,1,9,13,null,1,13,14,null,0,5,13,null,0,10,15,null,0,12,11,null,0,9,12,null,0,10,13,null,0,8,14,null,0,6,12,null,0,10,12,null,0,1,11,null,0,10,14,null,0,1,10,null,0,11,11,null,0,4,14,null,0,4,13,null,0,0,0,null,0,7,17,null,1,9,15,null,0,3,11,null,0,2,9,null,0,4,13,null,0,3,13,null,0,0,12,null,null,null,null,null,null,null,null,null,null,null,null,null,null,null,null,null,0,1,7,null,0,3,10,null,0,3,12,null,0,7,13,null,0,6,12]
[23,null,0,0,5,null,0,5,14,null,0,14,15,null,0,7,15,null,0,0,11,null,2,13,13,null,0,8,13,null,0,5,12,null,0,2,11,null,0,4,13,null,0,13,15,null,0,1,13,null,0,7,13,null,0,5,14,null,0,1,4,null,0,4,13,null,0,5,13,null,0,2,10,null,0,2,10,null,0,5,12,null,0,5,13,null,0,6,12,null,0,5,13,null,0,0,10,null,0,0,9,null,0,5,13,null,0,8,15,null,0,0,8,null,0,5,10,null,0,6,15,null,0,3,13,null,0,6,14,null,0,11,13,null,0,4,12,null,0,7,16,null,0,8,14,null,0,6,12,null,0,6,13,null,0,5,15,null,0,5,14,null,0,10,13,null,0,1,11,null,0,6,15,null,0,0,8,null,0,8,14,null,0,1,13,null,0,2,15,null,0,0,0,null,0,5,13,null,0,5,13,null,0,0,11,null,0,0,10,null,0,5,14,null,0,1,11,null,0,0,10,null,null,null,null,null,null,null,null,null,null,null,null,null,null,null,null,null,0,0,5,null,0,0,9,null,0,2,12,null,0,5,13,null,0,5,11]
[24,null,0,0,5,null,0,3,10,null,0,12,16,null,0,6,16,null,0,0,11,null,1,12,10,null,0,6,15,null,0,3,11,null,0,1,6,null,0,2,13,null,0,12,16,null,0,0,12,null,0,5,14,null,0,3,13,null,0,0,4,null,0,2,9,null,0,4,13,null,0,1,9,null,0,1,12,null,0,4,12,null,0,6,11,null,0,6,14,null,0,2,10,null,0,0,7,null,0,0,10,null,0,4,11,null,0,4,12,null,0,0,6,null,0,2,10,null,0,3,12,null,0,1,11,null,0,5,12,null,0,8,14,null,0,2,13,null,0,4,13,null,0,5,14,null,0,3,14,null,0,4,13,null,0,2,15,null,0,2,13,null,0,5,13,null,0,0,9,null,0,4,14,null,0,0,8,null,0,4,14,null,0,1,11,null,0,1,11,null,0,0,0,null,0,1,12,null,0,5,14,null,0,0,9,null,0,0,8,null,0,2,12,null,0,0,10,null,0,0,8,null,null,null,null,null,null,null,null,null,null,null,null,null,null,null,null,null,0,0,5,null,0,0,7,null,0,0,12,null,0,5,12,null,0,2,10]
[25,null,0,0,4,null,0,2,11,null,0,6,13,null,0,3,13,null,0,0,9,null,0,9,15,null,0,5,13,null,0,2,11,null,0,1,7,null,0,0,10,null,0,9,13,null,0,0,10,null,0,4,14,null,0,2,10,null,0,0,2,null,0,0,9,null,0,1,12,null,0,1,8,null,0,0,8,null,0,2,13,null,0,2,15,null,0,3,13,null,0,1,11,null,0,0,6,null,0,0,6,null,0,3,12,null,0,5,11,null,0,0,3,null,0,1,6,null,0,2,13,null,0,1,11,null,0,2,10,null,0,4,12,null,0,0,10,null,0,3,14,null,0,3,13,null,0,3,13,null,0,4,12,null,0,2,10,null,0,0,12,null,0,4,14,null,0,0,9,null,0,2,12,null,0,0,6,null,0,3,12,null,0,0,10,null,0,0,10,null,0,0,0,null,0,0,14,null,0,4,15,null,0,0,9,null,0,0,9,null,0,1,12,null,0,0,11,null,0,0,9,null,null,null,null,null,null,null,null,null,null,null,null,null,null,null,null,null,0,0,2,null,0,0,7,null,0,0,10,null,0,1,10,null,0,3,8]
[26,null,0,0,2,null,0,1,9,null,0,5,14,null,0,3,12,null,0,0,9,null,0,4,11,null,0,2,11,null,0,0,8,null,0,0,5,null,0,0,12,null,0,4,13,null,0,0,9,null,0,2,11,null,0,1,9,null,0,0,3,null,0,0,9,null,0,1,10,null,0,0,6,null,0,0,8,null,0,1,7,null,0,1,9,null,0,2,10,null,0,0,9,null,0,0,6,null,0,0,5,null,0,0,10,null,0,3,11,null,0,0,1,null,0,0,6,null,0,0,12,null,0,0,10,null,0,1,11,null,0,2,10,null,0,0,10,null,0,1,12,null,0,2,13,null,0,1,12,null,0,0,12,null,0,0,10,null,0,0,11,null,0,2,12,null,0,0,7,null,0,1,10,null,0,0,4,null,0,2,10,null,0,0,8,null,0,0,9,null,0,0,0,null,0,0,12,null,0,2,12,null,0,0,10,null,0,0,6,null,0,0,10,null,0,0,9,null,0,0,8,null,null,null,null,null,null,null,null,null,null,null,null,null,null,null,null,null,0,0,2,null,0,0,4,null,0,0,8,null,0,0,10,null,0,1,8]
[27,null,0,0,1,null,0,0,8,null,0,1,14,null,0,0,11,null,0,0,9,null,0,4,11,null,0,1,13,null,0,0,9,null,0,0,4,null,0,0,12,null,0,1,15,null,0,0,7,null,0,1,10,null,0,0,9,null,0,0,2,null,0,0,8,null,0,0,9,null,0,0,6,null,0,0,7,null,0,0,9,null,0,1,9,null,0,1,10,null,0,0,9,null,0,0,3,null,0,0,4,null,0,0,8,null,0,0,8,null,0,0,0,null,0,0,5,null,0,0,12,null,0,0,7,null,0,0,9,null,0,3,13,null,0,0,9,null,0,0,11,null,0,1,11,null,0,0,12,null,0,0,13,null,0,0,9,null,0,0,11,null,0,1,10,null,0,0,4,null,0,0,9,null,0,0,2,null,0,1,10,null,0,0,7,null,0,0,10,null,0,0,0,null,0,0,13,null,0,1,10,null,0,0,6,null,0,0,5,null,0,0,9,null,0,0,7,null,0,0,4,null,null,null,null,null,null,null,null,null,null,null,null,null,null,null,null,null,0,0,1,null,0,0,5,null,0,0,7,null,0,0,9,null,0,0,6]
[28,null,0,0,0,null,0,0,6,null,0,0,14,null,0,0,12,null,0,0,7,null,0,3,10,null,0,1,10,null,0,0,7,null,0,0,3,null,0,0,9,null,0,0,10,null,0,0,6,null,0,0,8,null,0,0,6,null,0,0,1,null,0,0,7,null,0,0,7,null,0,0,4,null,0,0,6,null,0,0,7,null,0,0,7,null,0,0,8,null,0,0,8,null,0,0,3,null,0,0,3,null,0,0,8,null,0,0,9,null,0,0,0,null,0,0,4,null,0,0,10,null,0,0,8,null,0,0,7,null,0,0,11,null,0,0,6,null,0,0,12,null,0,0,12,null,0,0,7,null,0,0,10,null,0,0,8,null,0,0,10,null,0,0,9,null,0,0,4,null,0,0,8,null,0,0,1,null,0,0,11,null,0,0,9,null,0,0,9,null,0,0,0,null,0,0,11,null,0,0,8,null,0,0,5,null,0,0,4,null,0,0,6,null,0,0,4,null,0,0,2,null,null,null,null,null,null,null,null,null,null,null,null,null,null,null,null,null,0,0,0,null,0,0,2,null,0,0,5,null,0,0,7,null,0,0,5]
[29,null,0,0,0,null,0,0,6,null,0,0,13,null,0,0,10,null,0,0,5,null,0,1,11,null,0,0,8,null,0,0,6,null,0,0,1,null,0,0,8,null,0,0,11,null,0,0,3,null,0,0,6,null,0,0,6,null,0,0,0,null,0,0,5,null,0,0,6,null,0,0,3,null,0,0,5,null,0,0,5,null,0,0,5,null,0,0,5,null,0,0,5,null,0,0,1,null,0,0,2,null,0,0,6,null,0,0,5,null,0,0,0,null,0,0,2,null,0,0,9,null,0,0,8,null,0,0,6,null,0,0,10,null,0,0,6,null,0,0,8,null,0,0,10,null,0,0,9,null,0,0,10,null,0,0,7,null,0,0,10,null,0,0,8,null,0,0,2,null,0,0,9,null,0,0,0,null,0,0,9,null,0,0,7,null,0,0,7,null,0,0,0,null,0,0,6,null,0,0,5,null,0,0,4,null,0,0,2,null,0,0,5,null,0,0,3,null,0,0,1,null,null,null,null,null,null,null,null,null,null,null,null,null,null,null,null,null,0,0,0,null,0,0,2,null,0,0,6,null,0,0,7,null,0,0,4]
[30,null,0,0,0,null,0,0,10,null,0,0,19,null,0,0,18,null,0,0,7,null,0,0,30,null,0,0,25,null,0,0,10,null,0,0,1,null,0,0,12,null,0,0,37,null,0,0,4,null,0,0,17,null,0,0,14,null,0,0,0,null,0,0,10,null,0,0,17,null,0,0,4,null,0,0,7,null,0,0,15,null,0,0,17,null,0,0,18,null,0,0,10,null,0,0,1,null,0,0,0,null,0,0,12,null,0,0,11,null,0,0,0,null,0,0,1,null,0,0,23,null,0,0,17,null,0,0,9,null,0,0,22,null,0,0,12,null,0,0,21,null,0,0,26,null,0,0,27,null,0,0,20,null,0,0,17,null,0,0,18,null,0,0,17,null,0,0,3,null,0,0,19,null,0,0,0,null,0,0,19,null,0,0,11,null,0,0,13,null,0,0,0,null,0,0,12,null,0,0,14,null,0,0,4,null,0,0,1,null,0,0,11,null,0,0,2,null,0,0,0,null,null,null,null,null,null,null,null,null,null,null,null,null,null,null,null,null,0,0,0,null,0,0,0,null,0,0,6,null,0,0,14,null,0,0,5]

{"sheet":"AT-Vergleichsdaten","index":9,"n_rows":60,"n_cols":257,"rows_kept":60,"cut":false,"hidden":true,"merged":[]}
[null,null,"Davos (CH)",null,null,null,"Zürich/Fluntern (CH)",null,null,null,"Locarno/Monti (CH)",null,null,null,"Graz Universität (AT)",null,null,null,"Tamsweg (AT)",null,null,null,"Wien innere Stadt (AT)",null,null,null,"Karlsruhe/Rheinstetten (DE)",null,null,null,"München Flughafen (DE)",null,null,null,"Hohenpeißenberg (DE)",null,null,null,"BRNIK LETALIŠČE (SI)",null,null,null,"BILJE (SI)",null,null,null,"NOVA VAS, BLOKE (SI)",null,null,null,"Frankfurt/Main Flughafen (DE)",null,null,null,"Trier-Petrisberg (DE)",null,null,null,"Kahler Asten (DE)",null,null,null,"Augsburg (DE)",null,null,null,"Bamberg (DE)",null,null,null,"Hof (DE)",null,null,null,"Kempten (DE)",null,null,null,"Nürnberg (DE)",null,null,null,"Würzburg (DE)",null,null,null,"Basel-Binningen (CH)",null,null,null,"Bern/Zollikofen (CH)",null,null,null,"La Chaux-de-Fonds (CH)",null,null,null,"Engelberg (CH)",null,null,null,"Luzern (CH)",null,null,null,"Pully (CH)",null,null,null,"Samedan (CH)",null,null,null,"St. Gallen (CH)",null,null,null,"Visp (CH)",null,null,null,"Bad Aussee (AT)",null,null,null,"Bregenz (AT)",null,null,null,"Eisenstadt (AT)",null,null,null,"Freistadt (AT)",null,null,null,"Fürstenfeld (AT)",null,null,null,"Hohenau/March (AT)",null,null,null,"Innsbruck Universität (AT)",null,null,null,"Klagenfurt Flughafen (AT)",null,null,null,"Kufstein (AT)",null,null,null,"Lienz (AT)",null,null,null,"Linz Stadt (AT)",null,null,null,"Mariazell (AT)",null,null,null,"Salzburg-Freisaal (AT)",null,null,null,"Schröcken (AT)",null,null,null,"St. Pölten (AT)",null,null,null,"Zell am See (AT)",null,null,null,"Zeltweg (AT)",null,null,null,"Andermatt (CH)",null,null,null,"Acquarossa/Comprovasco (CH)",null,null,null,"Bad Ragaz (CH)",null,null,null,"Château-d'Oex (CH)",null,null,null,"Disentis/Sedrun (CH)",null,null,null,"Fribourg/Posieux (CH)",null,null,null,"Piotta (CH)",null,null,null,"Ulrichen (CH)",null,null,null,"Italien 1",null,null,null,"Italien 2",null,null,null,"Italien 3",null,null,null,"Italien 4",null,null,null,"Bullet / La Fretaz (CH)",null,null,null,"Einsiedeln (CH)",null,null,null,"Langnau i.E. (CH)",null,null,null,"Payerne (CH)",null,null,null,"Rünenberg (CH)"]
[null,null,null,0,null,null,null,1,null,null,null,1,null,null,null,0,null,null,null,0,null,null,null,0,null,null,null,0,null,null,null,0,null,null,null,0,null,null,null,0,null,null,null,0,null,null,null,0,null,null,null,0,null,null,null,0,null,null,null,0,null,null,null,0,null,null,null,0,null,null,null,0,null,null,null,0,null,null,null,0,null,null,null,0,null,null,null,0,null,null,null,0,null,null,null,1,null,null,null,0,null,null,null,0,null,null,null,0,null,null,null,0,null,null,null,0,null,null,null,0,null,null,null,0,null,null,null,0,null,null,null,0,null,null,null,0,null,null,null,0,null,null,null,0,null,null,null,0,null,null,null,0,null,null,null,0,null,null,null,0,null,null,null,0,null,null,null,0,null,null,null,0,null,null,null,0,null,null,null,0,null,null,null,0,null,null,null,0,null,null,null,0,null,null,null,0,null,null,null,0,null,null,null,0,null,null,null,0,null,null,null,0,null,null,null,0,null,null,null,1,null,null,null,0,null,null,null,0,null,null,null,0,null,null,null,0,null,null,null,0,null,null,null,0,null,null,null,0,null,null,null,0,null,null,null,0]
[null,null,{"$f":"IF(D2=1,Klimadaten!C3,\"\")","v":""},null,null,null,{"$f":"IF(H2=1,Klimadaten!G3,\"\")","v":"Zürich/Fluntern (CH)"},null,null,null,{"$f":"IF(L2=1,Klimadaten!K3,\"\")","v":"Locarno/Monti (CH)"},null,null,null,{"$f":"IF(P2=1,Klimadaten!O3,\"\")","v":""},null,null,null,{"$f":"IF(T2=1,Klimadaten!S3,\"\")","v":""},null,null,null,{"$f":"IF(X2=1,Klimadaten!W3,\"\")","v":""},null,null,null,{"$f":"IF(AB2=1,Klimadaten!AA3,\"\")","v":""},null,null,null,{"$f":"IF(AF2=1,Klimadaten!AE3,\"\")","v":""},null,null,null,{"$f":"IF(AJ2=1,Klimadaten!AI3,\"\")","v":""},null,null,null,{"$f":"IF(AN2=1,Klimadaten!AM3,\"\")","v":""},null,null,null,{"$f":"IF(AR2=1,Klimadaten!AQ3,\"\")","v":""},null,null,null,{"$f":"IF(AV2=1,Klimadaten!AU3,\"\")","v":""},null,null,null,{"$f":"IF(AZ2=1,Klimadaten!AY3,\"\")","v":""},null,null,null,{"$f":"IF(BD2=1,Klimadaten!BC3,\"\")","v":""},null,null,null,{"$f":"IF(BH2=1,Klimadaten!BG3,\"\")","v":""},null,null,null,{"$f":"IF(BL2=1,Klimadaten!BK3,\"\")","v":""},null,null,null,{"$f":"IF(BP2=1,Klimadaten!BO3,\"\")","v":""},null,null,null,{"$f":"IF(BT2=1,Klimadaten!BS3,\"\")","v":""},null,null,null,{"$f":"IF(BX2=1,Klimadaten!BW3,\"\")","v":""},null,null,null,{"$f":"IF(CB2=1,Klimadaten!CA3,\"\")","v":""},null,null,null,{"$f":"IF(CF2=1,Klimadaten!CE3,\"\")","v":""},null,null,null,{"$f":"IF(CJ2=1,Klimadaten!CI3,\"\")","v":""},null,null,null,{"$f":"IF(CN2=1,Klimadaten!CM3,\"\")","v":""},null,null,null,{"$f":"IF(CR2=1,Klimadaten!CQ3,\"\")","v":"La Chaux-de-Fonds (CH)"},null,null,null,{"$f":"IF(CV2=1,Klimadaten!CU3,\"\")","v":""},null,null,null,{"$f":"IF(CZ2=1,Klimadaten!CY3,\"\")","v":""},null,null,null,{"$f":"IF(DD2=1,Klimadaten!DC3,\"\")","v":""},null,null,null,{"$f":"IF(DH2=1,Klimadaten!DG3,\"\")","v":""},null,null,null,{"$f":"IF(DL2=1,Klimadaten!DK3,\"\")","v":""},null,null,null,{"$f":"IF(DP2=1,Klimadaten!DO3,\"\")","v":""},null,null,null,{"$f":"IF(DT2=1,Klimadaten!DS3,\"\")","v":""},null,null,null,{"$f":"IF(DX2=1,Klimadaten!DW3,\"\")","v":""},null,null,null,{"$f":"IF(EB2=1,Klimadaten!EA3,\"\")","v":""},null,null,null,{"$f":"IF(EF2=1,Klimadaten!EE3,\"\")","v":""},null,null,null,{"$f":"IF(EJ2=1,Klimadaten!EI3,\"\")","v":""},null,null,null,{"$f":"IF(EN2=1,Klimadaten!EM3,\"\")","v":""},null,null,null,{"$f":"IF(ER2=1,Klimadaten!EQ3,\"\")","v":""},null,null,null,{"$f":"IF(EV2=1,Klimadaten!EU3,\"\")","v":""},null,null,null,{"$f":"IF(EZ2=1,Klimadaten!EY3,\"\")","v":""},null,null,null,{"$f":"IF(FD2=1,Klimadaten!FC3,\"\")","v":""},null,null,null,{"$f":"IF(FH2=1,Klimadaten!FG3,\"\")","v":""},null,null,null,{"$f":"IF(FL2=1,Klimadaten!FK3,\"\")","v":""},null,null,null,{"$f":"IF(FP2=1,Klimadaten!FO3,\"\")","v":""},null,null,null,{"$f":"IF(FT2=1,Klimadaten!FS3,\"\")","v":""},null,null,null,{"$f":"IF(FX2=1,Klimadaten!FW3,\"\")","v":""},null,null,null,{"$f":"IF(GB2=1,Klimadaten!GA3,\"\")","v":""},null,null,null,{"$f":"IF(GF2=1,Klimadaten!GE3,\"\")","v":""},null,null,null,{"$f":"IF(GJ2=1,Klimadaten!GI3,\"\")","v":""},null,null,null,{"$f":"IF(GN2=1,Klimadaten!GM3,\"\")","v":""},null,null,null,{"$f":"IF(GR2=1,Klimadaten!GQ3,\"\")","v":""},null,null,null,{"$f":"IF(GV2=1,Klimadaten!GU3,\"\")","v":""},null,null,null,{"$f":"IF(GZ2=1,Klimadaten!GY3,\"\")","v":""},null,null,null,{"$f":"IF(HD2=1,Klimadaten!HC3,\"\")","v":""},null,null,null,{"$f":"IF(HH2=1,Klimadaten!HG3,\"\")","v":""},null,null,null,{"$f":"IF(HL2=1,Klimadaten!HK3,\"\")","v":"Ulrichen (CH)"},null,null,null,{"$f":"IF(HP2=1,Klimadaten!HO3,\"\")","v":""},null,null,null,{"$f":"IF(HT2=1,Klimadaten!HS3,\"\")","v":""},null,null,null,{"$f":"IF(HX2=1,Klimadaten!HW3,\"\")","v":""},null,null,null,{"$f":"IF(IB2=1,Klimadaten!IA3,\"\")","v":""},null,null,null,{"$f":"IF(IF2=1,Klimadaten!IE3,\"\")","v":""},null,null,null,{"$f":"IF(IJ2=1,Klimadaten!II3,\"\")","v":""},null,null,null,{"$f":"IF(IN2=1,Klimadaten!IM3,\"\")","v":""},null,null,null,{"$f":"IF(IR2=1,Klimadaten!IQ3,\"\")","v":""},null,null,null,{"$f":"IF(IV2=1,Klimadaten!IU3,\"\")","v":""}]
[]
[]
[null,null,"Häufigkeit",null,null,null,"Häufigkeit",null,null,null,"Häufigkeit",null,null,null,"Häufigkeit",null,null,null,"Häufigkeit",null,null,null,"Häufigkeit",null,null,null,"Häufigkeit",null,null,null,"Häufigkeit",null,null,null,"Häufigkeit",null,null,null,"Häufigkeit",null,null,null,"Häufigkeit",null,null,null,"Häufigkeit",null,null,null,"Häufigkeit",null,null,null,"Häufigkeit",null,null,null,"Häufigkeit",null,null,null,"Häufigkeit",null,null,null,"Häufigkeit",null,null,null,"Häufigkeit",null,null,null,"Häufigkeit",null,null,null,"Häufigkeit",null,null,null,"Häufigkeit",null,null,null,"Häufigkeit",null,null,null,"Häufigkeit",null,null,null,"Häufigkeit",null,null,null,"Häufigkeit",null,null,null,"Häufigkeit",null,null,null,"Häufigkeit",null,null,null,"Häufigkeit",null,null,null,"Häufigkeit",null,null,null,"Häufigkeit",null,null,null,"Häufigkeit",null,null,null,"Häufigkeit",null,null,null,"Häufigkeit",null,null,null,"Häufigkeit",null,null,null,"Häufigkeit",null,null,null,"Häufigkeit",null,null,null,"Häufigkeit",null,null,null,"Häufigkeit",null,null,null,"Häufigkeit",null,null,null,"Häufigkeit",null,null,null,"Häufigkeit",null,null,null,"Häufigkeit",null,null,null,"Häufigkeit",null,null,null,"Häufigkeit",null,null,null,"Häufigkeit",null,null,null,"Häufigkeit",null,null,null,"Häufigkeit",null,null,null,"Häufigkeit",null,null,null,"Häufigkeit",null,null,null,"Häufigkeit",null,null,null,"Häufigkeit",null,null,null,"Häufigkeit",null,null,null,"Häufigkeit",null,null,null,"Häufigkeit",null,null,null,"Häufigkeit",null,null,null,"Häufigkeit",null,null,null,"Häufigkeit",null,null,null,"Häufigkeit",null,null,null,"Häufigkeit",null,null,null,"Häufigkeit",null,null,null,"Häufigkeit",null,null,null,"Häufigkeit",null,null,null,"Häufigkeit",null,null,null,"Häufigkeit"]
[null,null,"Min.","Mittel","Max.",null,"Min.","Mittel","Max.",null,"Min.","Mittel","Max.",null,"Min.","Mittel","Max.",null,"Min.","Mittel","Max.",null,"Min.","Mittel","Max.",null,"Min.","Mittel","Max.",null,"Min.","Mittel","Max.",null,"Min.","Mittel","Max.",null,"Min.","Mittel","Max.",null,"Min.","Mittel","Max.",null,"Min.","Mittel","Max.",null,"Min.","Mittel","Max.",null,"Min.","Mittel","Max.",null,"Min.","Mittel","Max.",null,"Min.","Mittel","Max.",null,"Min.","Mittel","Max.",null,"Min.","Mittel","Max.",null,"Min.","Mittel","Max.",null,"Min.","Mittel","Max.",null,"Min.","Mittel","Max.",null,"Min.","Mittel","Max.",null,"Min.","Mittel","Max.",null,"Min.","Mittel","Max.",null,"Min.","Mittel","Max.",null,"Min.","Mittel","Max.",null,"Min.","Mittel","Max.",null,"Min.","Mittel","Max.",null,"Min.","Mittel","Max.",null,"Min.","Mittel","Max.",null,"Min.","Mittel","Max.",null,"Min.","Mittel","Max.",null,"Min.","Mittel","Max.",null,"Min.","Mittel","Max.",null,"Min.","Mittel","Max.",null,"Min.","Mittel","Max.",null,"Min.","Mittel","Max.",null,"Min.","Mittel",null,null,"Min.","Mittel","Max.",null,"Min.","Mittel","Max.",null,"Min.","Mittel","Max.",null,"Min.","Mittel","Max.",null,"Min.","Mittel","Max.",null,"Min.","Mittel","Max.",null,"Min.","Mittel","Max.",null,"Min.","Mittel","Max.",null,"Min.","Mittel","Max.",null,"Min.","Mittel","Max.",null,"Min.","Mittel","Max.",null,"Min.","Mittel","Max.",null,"Min.","Mittel","Max.",null,"Min.","Mittel","Max.",null,"Min.","Mittel","Max.",null,"Min.","Mittel","Max.",null,"Min.","Mittel","Max.",null,"Min.","Mittel","Max.",null,"Min.","Mittel","Max.",null,"Min.","Mittel","Max.",null,"Min.","Mittel","Max.",null,"Min.","Mittel","Max.",null,"Min.","Mittel","Max.",null,"Min.","Mittel","Max.",null,"Min.","Mittel","Max.",null,"Min.","Mittel","Max."]
[]
[]
[-20,null,null,{"$f":"IF(D$2=1,Klimadaten!D10,\"\")","v":""},null,null,null,{"$f":"IF(H$2=1,Klimadaten!H10,\"\")","v":0},null,null,null,{"$f":"IF(L$2=1,Klimadaten!L10,\"\")","v":0},null,null,null,{"$f":"IF(P$2=1,Klimadaten!P10,\"\")","v":""},null,null,null,{"$f":"IF(T$2=1,Klimadaten!T10,\"\")","v":""},null,null,null,{"$f":"IF(X$2=1,Klimadaten!X10,\"\")","v":""},null,null,null,{"$f":"IF(AB$2=1,Klimadaten!AB10,\"\")","v":""},null,null,null,{"$f":"IF(AF$2=1,Klimadaten!AF10,\"\")","v":""},null,null,null,{"$f":"IF(AJ$2=1,Klimadaten!AJ10,\"\")","v":""},null,null,null,{"$f":"IF(AN$2=1,Klimadaten!AN10,\"\")","v":""},null,null,null,{"$f":"IF(AR$2=1,Klimadaten!AR10,\"\")","v":""},null,null,null,{"$f":"IF(AV$2=1,Klimadaten!AV10,\"\")","v":""},null,null,null,{"$f":"IF(AZ$2=1,Klimadaten!AZ10,\"\")","v":""},null,null,null,{"$f":"IF(BD$2=1,Klimadaten!BD10,\"\")","v":""},null,null,null,{"$f":"IF(BH$2=1,Klimadaten!BH10,\"\")","v":""},null,null,null,{"$f":"IF(BL$2=1,Klimadaten!BL10,\"\")","v":""},null,null,null,{"$f":"IF(BP$2=1,Klimadaten!BP10,\"\")","v":""},null,null,null,{"$f":"IF(BT$2=1,Klimadaten!BT10,\"\")","v":""},null,null,null,{"$f":"IF(BX$2=1,Klimadaten!BX10,\"\")","v":""},null,null,null,{"$f":"IF(CB$2=1,Klimadaten!CB10,\"\")","v":""},null,null,null,{"$f":"IF(CF$2=1,Klimadaten!CF10,\"\")","v":""},null,null,null,{"$f":"IF(CJ$2=1,Klimadaten!CJ10,\"\")","v":""},null,null,null,{"$f":"IF(CN$2=1,Klimadaten!CN10,\"\")","v":""},null,null,null,{"$f":"IF(CR$2=1,Klimadaten!CR10,\"\")","v":0},null,null,null,{"$f":"IF(CV$2=1,Klimadaten!CV10,\"\")","v":""},null,null,null,{"$f":"IF(CZ$2=1,Klimadaten!CZ10,\"\")","v":""},null,null,null,{"$f":"IF(DD$2=1,Klimadaten!DD10,\"\")","v":""},null,null,null,{"$f":"IF(DH$2=1,Klimadaten!DH10,\"\")","v":""},null,null,null,{"$f":"IF(DL$2=1,Klimadaten!DL10,\"\")","v":""},null,null,null,{"$f":"IF(DP$2=1,Klimadaten!DP10,\"\")","v":""},null,null,null,{"$f":"IF(DT$2=1,Klimadaten!DT10,\"\")","v":""},null,null,null,{"$f":"IF(DX$2=1,Klimadaten!DX10,\"\")","v":""},null,null,null,{"$f":"IF(EB$2=1,Klimadaten!EB10,\"\")","v":""},null,null,null,{"$f":"IF(EF$2=1,Klimadaten!EF10,\"\")","v":""},null,null,null,{"$f":"IF(EJ$2=1,Klimadaten!EJ10,\"\")","v":""},null,null,null,{"$f":"IF(EN$2=1,Klimadaten!EN10,\"\")","v":""},null,null,null,{"$f":"IF(ER$2=1,Klimadaten!ER10,\"\")","v":""},null,null,null,{"$f":"IF(EV$2=1,Klimadaten!EV10,\"\")","v":""},null,null,null,{"$f":"IF(EZ$2=1,Klimadaten!EZ10,\"\")","v":""},null,null,null,{"$f":"IF(FD$2=1,Klimadaten!FD10,\"\")","v":""},null,null,null,{"$f":"IF(FH$2=1,Klimadaten!FH10,\"\")","v":""},null,null,null,{"$f":"IF(FL$2=1,Klimadaten!FL10,\"\")","v":""},null,null,null,{"$f":"IF(FP$2=1,Klimadaten!FP10,\"\")","v":""},null,null,null,{"$f":"IF(FT$2=1,Klimadaten!FT10,\"\")","v":""},null,null,null,{"$f":"IF(FX$2=1,Klimadaten!FX10,\"\")","v":""},null,null,null,{"$f":"IF(GB$2=1,Klimadaten!GB10,\"\")","v":""},null,null,null,{"$f":"IF(GF$2=1,Klimadaten!GF10,\"\")","v":""},null,null,null,{"$f":"IF(GJ$2=1,Klimadaten!GJ10,\"\")","v":""},null,null,null,{"$f":"IF(GN$2=1,Klimadaten!GN10,\"\")","v":""},null,null,null,{"$f":"IF(GR$2=1,Klimadaten!GR10,\"\")","v":""},null,null,null,{"$f":"IF(GV$2=1,Klimadaten!GV10,\"\")","v":""},null,null,null,{"$f":"IF(GZ$2=1,Klimadaten!GZ10,\"\")","v":""},null,null,null,{"$f":"IF(HD$2=1,Klimadaten!HD10,\"\")","v":""},null,null,null,{"$f":"IF(HH$2=1,Klimadaten!HH10,\"\")","v":""},null,null,null,{"$f":"IF(HL$2=1,Klimadaten!HL10,\"\")","v":0},null,null,null,null,null,null,null,null,null,null,null,null,null,null,null,null,null,null,null,{"$f":"IF(IF$2=1,Klimadaten!IF10,\"\")","v":""},null,null,null,{"$f":"IF(IJ$2=1,Klimadaten!IJ10,\"\")","v":""},null,null,null,{"$f":"IF(IN$2=1,Klimadaten!IN10,\"\")","v":""},null,null,null,{"$f":"IF(IR$2=1,Klimadaten!IR10,\"\")","v":""},null,null,null,{"$f":"IF(IV$2=1,Klimadaten!IV10,\"\")","v":""}]
[-19,null,null,{"$f":"IF(D$2=1,Klimadaten!D11,\"\")","v":""},null,null,null,{"$f":"IF(H$2=1,Klimadaten!H11,\"\")","v":0},null,null,null,{"$f":"IF(L$2=1,Klimadaten!L11,\"\")","v":0},null,null,null,{"$f":"IF(P$2=1,Klimadaten!P11,\"\")","v":""},null,null,null,{"$f":"IF(T$2=1,Klimadaten!T11,\"\")","v":""},null,null,null,{"$f":"IF(X$2=1,Klimadaten!X11,\"\")","v":""},null,null,null,{"$f":"IF(AB$2=1,Klimadaten!AB11,\"\")","v":""},null,null,null,{"$f":"IF(AF$2=1,Klimadaten!AF11,\"\")","v":""},null,null,null,{"$f":"IF(AJ$2=1,Klimadaten!AJ11,\"\")","v":""},null,null,null,{"$f":"IF(AN$2=1,Klimadaten!AN11,\"\")","v":""},null,null,null,{"$f":"IF(AR$2=1,Klimadaten!AR11,\"\")","v":""},null,null,null,{"$f":"IF(AV$2=1,Klimadaten!AV11,\"\")","v":""},null,null,null,{"$f":"IF(AZ$2=1,Klimadaten!AZ11,\"\")","v":""},null,null,null,{"$f":"IF(BD$2=1,Klimadaten!BD11,\"\")","v":""},null,null,null,{"$f":"IF(BH$2=1,Klimadaten!BH11,\"\")","v":""},null,null,null,{"$f":"IF(BL$2=1,Klimadaten!BL11,\"\")","v":""},null,null,null,{"$f":"IF(BP$2=1,Klimadaten!BP11,\"\")","v":""},null,null,null,{"$f":"IF(BT$2=1,Klimadaten!BT11,\"\")","v":""},null,null,null,{"$f":"IF(BX$2=1,Klimadaten!BX11,\"\")","v":""},null,null,null,{"$f":"IF(CB$2=1,Klimadaten!CB11,\"\")","v":""},null,null,null,{"$f":"IF(CF$2=1,Klimadaten!CF11,\"\")","v":""},null,null,null,{"$f":"IF(CJ$2=1,Klimadaten!CJ11,\"\")","v":""},null,null,null,{"$f":"IF(CN$2=1,Klimadaten!CN11,\"\")","v":""},null,null,null,{"$f":"IF(CR$2=1,Klimadaten!CR11,\"\")","v":0},null,null,null,{"$f":"IF(CV$2=1,Klimadaten!CV11,\"\")","v":""},null,null,null,{"$f":"IF(CZ$2=1,Klimadaten!CZ11,\"\")","v":""},null,null,null,{"$f":"IF(DD$2=1,Klimadaten!DD11,\"\")","v":""},null,null,null,{"$f":"IF(DH$2=1,Klimadaten!DH11,\"\")","v":""},null,null,null,{"$f":"IF(DL$2=1,Klimadaten!DL11,\"\")","v":""},null,null,null,{"$f":"IF(DP$2=1,Klimadaten!DP11,\"\")","v":""},null,null,null,{"$f":"IF(DT$2=1,Klimadaten!DT11,\"\")","v":""},null,null,null,{"$f":"IF(DX$2=1,Klimadaten!DX11,\"\")","v":""},null,null,null,{"$f":"IF(EB$2=1,Klimadaten!EB11,\"\")","v":""},null,null,null,{"$f":"IF(EF$2=1,Klimadaten!EF11,\"\")","v":""},null,null,null,{"$f":"IF(EJ$2=1,Klimadaten!EJ11,\"\")","v":""},null,null,null,{"$f":"IF(EN$2=1,Klimadaten!EN11,\"\")","v":""},null,null,null,{"$f":"IF(ER$2=1,Klimadaten!ER11,\"\")","v":""},null,null,null,{"$f":"IF(EV$2=1,Klimadaten!EV11,\"\")","v":""},null,null,null,{"$f":"IF(EZ$2=1,Klimadaten!EZ11,\"\")","v":""},null,null,null,{"$f":"IF(FD$2=1,Klimadaten!FD11,\"\")","v":""},null,null,null,{"$f":"IF(FH$2=1,Klimadaten!FH11,\"\")","v":""},null,null,null,{"$f":"IF(FL$2=1,Klimadaten!FL11,\"\")","v":""},null,null,null,{"$f":"IF(FP$2=1,Klimadaten!FP11,\"\")","v":""},null,null,null,{"$f":"IF(FT$2=1,Klimadaten!FT11,\"\")","v":""},null,null,null,{"$f":"IF(FX$2=1,Klimadaten!FX11,\"\")","v":""},null,null,null,{"$f":"IF(GB$2=1,Klimadaten!GB11,\"\")","v":""},null,null,null,{"$f":"IF(GF$2=1,Klimadaten!GF11,\"\")","v":""},null,null,null,{"$f":"IF(GJ$2=1,Klimadaten!GJ11,\"\")","v":""},null,null,null,{"$f":"IF(GN$2=1,Klimadaten!GN11,\"\")","v":""},null,null,null,{"$f":"IF(GR$2=1,Klimadaten!GR11,\"\")","v":""},null,null,null,{"$f":"IF(GV$2=1,Klimadaten!GV11,\"\")","v":""},null,null,null,{"$f":"IF(GZ$2=1,Klimadaten!GZ11,\"\")","v":""},null,null,null,{"$f":"IF(HD$2=1,Klimadaten!HD11,\"\")","v":""},null,null,null,{"$f":"IF(HH$2=1,Klimadaten!HH11,\"\")","v":""},null,null,null,{"$f":"IF(HL$2=1,Klimadaten!HL11,\"\")","v":1},null,null,null,null,null,null,null,null,null,null,null,null,null,null,null,null,null,null,null,{"$f":"IF(IF$2=1,Klimadaten!IF11,\"\")","v":""},null,null,null,{"$f":"IF(IJ$2=1,Klimadaten!IJ11,\"\")","v":""},null,null,null,{"$f":"IF(IN$2=1,Klimadaten!IN11,\"\")","v":""},null,null,null,{"$f":"IF(IR$2=1,Klimadaten!IR11,\"\")","v":""},null,null,null,{"$f":"IF(IV$2=1,Klimadaten!IV11,\"\")","v":""}]
[-18,null,null,{"$f":"IF(D$2=1,Klimadaten!D12,\"\")","v":""},null,null,null,{"$f":"IF(H$2=1,Klimadaten!H12,\"\")","v":0},null,null,null,{"$f":"IF(L$2=1,Klimadaten!L12,\"\")","v":0},null,null,null,{"$f":"IF(P$2=1,Klimadaten!P12,\"\")","v":""},null,null,null,{"$f":"IF(T$2=1,Klimadaten!T12,\"\")","v":""},null,null,null,{"$f":"IF(X$2=1,Klimadaten!X12,\"\")","v":""},null,null,null,{"$f":"IF(AB$2=1,Klimadaten!AB12,\"\")","v":""},null,null,null,{"$f":"IF(AF$2=1,Klimadaten!AF12,\"\")","v":""},null,null,null,{"$f":"IF(AJ$2=1,Klimadaten!AJ12,\"\")","v":""},null,null,null,{"$f":"IF(AN$2=1,Klimadaten!AN12,\"\")","v":""},null,null,null,{"$f":"IF(AR$2=1,Klimadaten!AR12,\"\")","v":""},null,null,null,{"$f":"IF(AV$2=1,Klimadaten!AV12,\"\")","v":""},null,null,null,{"$f":"IF(AZ$2=1,Klimadaten!AZ12,\"\")","v":""},null,null,null,{"$f":"IF(BD$2=1,Klimadaten!BD12,\"\")","v":""},null,null,null,{"$f":"IF(BH$2=1,Klimadaten!BH12,\"\")","v":""},null,null,null,{"$f":"IF(BL$2=1,Klimadaten!BL12,\"\")","v":""},null,null,null,{"$f":"IF(BP$2=1,Klimadaten!BP12,\"\")","v":""},null,null,null,{"$f":"IF(BT$2=1,Klimadaten!BT12,\"\")","v":""},null,null,null,{"$f":"IF(BX$2=1,Klimadaten!BX12,\"\")","v":""},null,null,null,{"$f":"IF(CB$2=1,Klimadaten!CB12,\"\")","v":""},null,null,null,{"$f":"IF(CF$2=1,Klimadaten!CF12,\"\")","v":""},null,null,null,{"$f":"IF(CJ$2=1,Klimadaten!CJ12,\"\")","v":""},null,null,null,{"$f":"IF(CN$2=1,Klimadaten!CN12,\"\")","v":""},null,null,null,{"$f":"IF(CR$2=1,Klimadaten!CR12,\"\")","v":0},null,null,null,{"$f":"IF(CV$2=1,Klimadaten!CV12,\"\")","v":""},null,null,null,{"$f":"IF(CZ$2=1,Klimadaten!CZ12,\"\")","v":""},null,null,null,{"$f":"IF(DD$2=1,Klimadaten!DD12,\"\")","v":""},null,null,null,{"$f":"IF(DH$2=1,Klimadaten!DH12,\"\")","v":""},null,null,null,{"$f":"IF(DL$2=1,Klimadaten!DL12,\"\")","v":""},null,null,null,{"$f":"IF(DP$2=1,Klimadaten!DP12,\"\")","v":""},null,null,null,{"$f":"IF(DT$2=1,Klimadaten!DT12,\"\")","v":""},null,null,null,{"$f":"IF(DX$2=1,Klimadaten!DX12,\"\")","v":""},null,null,null,{"$f":"IF(EB$2=1,Klimadaten!EB12,\"\")","v":""},null,null,null,{"$f":"IF(EF$2=1,Klimadaten!EF12,\"\")","v":""},null,null,null,{"$f":"IF(EJ$2=1,Klimadaten!EJ12,\"\")","v":""},null,null,null,{"$f":"IF(EN$2=1,Klimadaten!EN12,\"\")","v":""},null,null,null,{"$f":"IF(ER$2=1,Klimadaten!ER12,\"\")","v":""},null,null,null,{"$f":"IF(EV$2=1,Klimadaten!EV12,\"\")","v":""},null,null,null,{"$f":"IF(EZ$2=1,Klimadaten!EZ12,\"\")","v":""},null,null,null,{"$f":"IF(FD$2=1,Klimadaten!FD12,\"\")","v":""},null,null,null,{"$f":"IF(FH$2=1,Klimadaten!FH12,\"\")","v":""},null,null,null,{"$f":"IF(FL$2=1,Klimadaten!FL12,\"\")","v":""},null,null,null,{"$f":"IF(FP$2=1,Klimadaten!FP12,\"\")","v":""},null,null,null,{"$f":"IF(FT$2=1,Klimadaten!FT12,\"\")","v":""},null,null,null,{"$f":"IF(FX$2=1,Klimadaten!FX12,\"\")","v":""},null,null,null,{"$f":"IF(GB$2=1,Klimadaten!GB12,\"\")","v":""},null,null,null,{"$f":"IF(GF$2=1,Klimadaten!GF12,\"\")","v":""},null,null,null,{"$f":"IF(GJ$2=1,Klimadaten!GJ12,\"\")","v":""},null,null,null,{"$f":"IF(GN$2=1,Klimadaten!GN12,\"\")","v":""},null,null,null,{"$f":"IF(GR$2=1,Klimadaten!GR12,\"\")","v":""},null,null,null,{"$f":"IF(GV$2=1,Klimadaten!GV12,\"\")","v":""},null,null,null,{"$f":"IF(GZ$2=1,Klimadaten!GZ12,\"\")","v":""},null,null,null,{"$f":"IF(HD$2=1,Klimadaten!HD12,\"\")","v":""},null,null,null,{"$f":"IF(HH$2=1,Klimadaten!HH12,\"\")","v":""},null,null,null,{"$f":"IF(HL$2=1,Klimadaten!HL12,\"\")","v":1},null,null,null,null,null,null,null,null,null,null,null,null,null,null,null,null,null,null,null,{"$f":"IF(IF$2=1,Klimadaten!IF12,\"\")","v":""},null,null,null,{"$f":"IF(IJ$2=1,Klimadaten!IJ12,\"\")","v":""},null,null,null,{"$f":"IF(IN$2=1,Klimadaten!IN12,\"\")","v":""},null,null,null,{"$f":"IF(IR$2=1,Klimadaten!IR12,\"\")","v":""},null,null,null,{"$f":"IF(IV$2=1,Klimadaten!IV12,\"\")","v":""}]
[-17,null,null,{"$f":"IF(D$2=1,Klimadaten!D13,\"\")","v":""},null,null,null,{"$f":"IF(H$2=1,Klimadaten!H13,\"\")","v":0},null,null,null,{"$f":"IF(L$2=1,Klimadaten!L13,\"\")","v":0},null,null,null,{"$f":"IF(P$2=1,Klimadaten!P13,\"\")","v":""},null,null,null,{"$f":"IF(T$2=1,Klimadaten!T13,\"\")","v":""},null,null,null,{"$f":"IF(X$2=1,Klimadaten!X13,\"\")","v":""},null,null,null,{"$f":"IF(AB$2=1,Klimadaten!AB13,\"\")","v":""},null,null,null,{"$f":"IF(AF$2=1,Klimadaten!AF13,\"\")","v":""},null,null,null,{"$f":"IF(AJ$2=1,Klimadaten!AJ13,\"\")","v":""},null,null,null,{"$f":"IF(AN$2=1,Klimadaten!AN13,\"\")","v":""},null,null,null,{"$f":"IF(AR$2=1,Klimadaten!AR13,\"\")","v":""},null,null,null,{"$f":"IF(AV$2=1,Klimadaten!AV13,\"\")","v":""},null,null,null,{"$f":"IF(AZ$2=1,Klimadaten!AZ13,\"\")","v":""},null,null,null,{"$f":"IF(BD$2=1,Klimadaten!BD13,\"\")","v":""},null,null,null,{"$f":"IF(BH$2=1,Klimadaten!BH13,\"\")","v":""},null,null,null,{"$f":"IF(BL$2=1,Klimadaten!BL13,\"\")","v":""},null,null,null,{"$f":"IF(BP$2=1,Klimadaten!BP13,\"\")","v":""},null,null,null,{"$f":"IF(BT$2=1,Klimadaten!BT13,\"\")","v":""},null,null,null,{"$f":"IF(BX$2=1,Klimadaten!BX13,\"\")","v":""},null,null,null,{"$f":"IF(CB$2=1,Klimadaten!CB13,\"\")","v":""},null,null,null,{"$f":"IF(CF$2=1,Klimadaten!CF13,\"\")","v":""},null,null,null,{"$f":"IF(CJ$2=1,Klimadaten!CJ13,\"\")","v":""},null,null,null,{"$f":"IF(CN$2=1,Klimadaten!CN13,\"\")","v":""},null,null,null,{"$f":"IF(CR$2=1,Klimadaten!CR13,\"\")","v":0},null,null,null,{"$f":"IF(CV$2=1,Klimadaten!CV13,\"\")","v":""},null,null,null,{"$f":"IF(CZ$2=1,Klimadaten!CZ13,\"\")","v":""},null,null,null,{"$f":"IF(DD$2=1,Klimadaten!DD13,\"\")","v":""},null,null,null,{"$f":"IF(DH$2=1,Klimadaten!DH13,\"\")","v":""},null,null,null,{"$f":"IF(DL$2=1,Klimadaten!DL13,\"\")","v":""},null,null,null,{"$f":"IF(DP$2=1,Klimadaten!DP13,\"\")","v":""},null,null,null,{"$f":"IF(DT$2=1,Klimadaten!DT13,\"\")","v":""},null,null,null,{"$f":"IF(DX$2=1,Klimadaten!DX13,\"\")","v":""},null,null,null,{"$f":"IF(EB$2=1,Klimadaten!EB13,\"\")","v":""},null,null,null,{"$f":"IF(EF$2=1,Klimadaten!EF13,\"\")","v":""},null,null,null,{"$f":"IF(EJ$2=1,Klimadaten!EJ13,\"\")","v":""},null,null,null,{"$f":"IF(EN$2=1,Klimadaten!EN13,\"\")","v":""},null,null,null,{"$f":"IF(ER$2=1,Klimadaten!ER13,\"\")","v":""},null,null,null,{"$f":"IF(EV$2=1,Klimadaten!EV13,\"\")","v":""},null,null,null,{"$f":"IF(EZ$2=1,Klimadaten!EZ13,\"\")","v":""},null,null,null,{"$f":"IF(FD$2=1,Klimadaten!FD13,\"\")","v":""},null,null,null,{"$f":"IF(FH$2=1,Klimadaten!FH13,\"\")","v":""},null,null,null,{"$f":"IF(FL$2=1,Klimadaten!FL13,\"\")","v":""},null,null,null,{"$f":"IF(FP$2=1,Klimadaten!FP13,\"\")","v":""},null,null,null,{"$f":"IF(FT$2=1,Klimadaten!FT13,\"\")","v":""},null,null,null,{"$f":"IF(FX$2=1,Klimadaten!FX13,\"\")","v":""},null,null,null,{"$f":"IF(GB$2=1,Klimadaten!GB13,\"\")","v":""},null,null,null,{"$f":"IF(GF$2=1,Klimadaten!GF13,\"\")","v":""},null,null,null,{"$f":"IF(GJ$2=1,Klimadaten!GJ13,\"\")","v":""},null,null,null,{"$f":"IF(GN$2=1,Klimadaten!GN13,\"\")","v":""},null,null,null,{"$f":"IF(GR$2=1,Klimadaten!GR13,\"\")","v":""},null,null,null,{"$f":"IF(GV$2=1,Klimadaten!GV13,\"\")","v":""},null,null,null,{"$f":"IF(GZ$2=1,Klimadaten!GZ13,\"\")","v":""},null,null,null,{"$f":"IF(HD$2=1,Klimadaten!HD13,\"\")","v":""},null,null,null,{"$f":"IF(HH$2=1,Klimadaten!HH13,\"\")","v":""},null,null,null,{"$f":"IF(HL$2=1,Klimadaten!HL13,\"\")","v":1},null,null,null,null,null,null,null,null,null,null,null,null,null,null,null,null,null,null,null,{"$f":"IF(IF$2=1,Klimadaten!IF13,\"\")","v":""},null,null,null,{"$f":"IF(IJ$2=1,Klimadaten!IJ13,\"\")","v":""},null,null,null,{"$f":"IF(IN$2=1,Klimadaten!IN13,\"\")","v":""},null,null,null,{"$f":"IF(IR$2=1,Klimadaten!IR13,\"\")","v":""},null,null,null,{"$f":"IF(IV$2=1,Klimadaten!IV13,\"\")","v":""}]
[-16,null,null,{"$f":"IF(D$2=1,Klimadaten!D14,\"\")","v":""},null,null,null,{"$f":"IF(H$2=1,Klimadaten!H14,\"\")","v":0},null,null,null,{"$f":"IF(L$2=1,Klimadaten!L14,\"\")","v":0},null,null,null,{"$f":"IF(P$2=1,Klimadaten!P14,\"\")","v":""},null,null,null,{"$f":"IF(T$2=1,Klimadaten!T14,\"\")","v":""},null,null,null,{"$f":"IF(X$2=1,Klimadaten!X14,\"\")","v":""},null,null,null,{"$f":"IF(AB$2=1,Klimadaten!AB14,\"\")","v":""},null,null,null,{"$f":"IF(AF$2=1,Klimadaten!AF14,\"\")","v":""},null,null,null,{"$f":"IF(AJ$2=1,Klimadaten!AJ14,\"\")","v":""},null,null,null,{"$f":"IF(AN$2=1,Klimadaten!AN14,\"\")","v":""},null,null,null,{"$f":"IF(AR$2=1,Klimadaten!AR14,\"\")","v":""},null,null,null,{"$f":"IF(AV$2=1,Klimadaten!AV14,\"\")","v":""},null,null,null,{"$f":"IF(AZ$2=1,Klimadaten!AZ14,\"\")","v":""},null,null,null,{"$f":"IF(BD$2=1,Klimadaten!BD14,\"\")","v":""},null,null,null,{"$f":"IF(BH$2=1,Klimadaten!BH14,\"\")","v":""},null,null,null,{"$f":"IF(BL$2=1,Klimadaten!BL14,\"\")","v":""},null,null,null,{"$f":"IF(BP$2=1,Klimadaten!BP14,\"\")","v":""},null,null,null,{"$f":"IF(BT$2=1,Klimadaten!BT14,\"\")","v":""},null,null,null,{"$f":"IF(BX$2=1,Klimadaten!BX14,\"\")","v":""},null,null,null,{"$f":"IF(CB$2=1,Klimadaten!CB14,\"\")","v":""},null,null,null,{"$f":"IF(CF$2=1,Klimadaten!CF14,\"\")","v":""},null,null,null,{"$f":"IF(CJ$2=1,Klimadaten!CJ14,\"\")","v":""},null,null,null,{"$f":"IF(CN$2=1,Klimadaten!CN14,\"\")","v":""},null,null,null,{"$f":"IF(CR$2=1,Klimadaten!CR14,\"\")","v":0},null,null,null,{"$f":"IF(CV$2=1,Klimadaten!CV14,\"\")","v":""},null,null,null,{"$f":"IF(CZ$2=1,Klimadaten!CZ14,\"\")","v":""},null,null,null,{"$f":"IF(DD$2=1,Klimadaten!DD14,\"\")","v":""},null,null,null,{"$f":"IF(DH$2=1,Klimadaten!DH14,\"\")","v":""},null,null,null,{"$f":"IF(DL$2=1,Klimadaten!DL14,\"\")","v":""},null,null,null,{"$f":"IF(DP$2=1,Klimadaten!DP14,\"\")","v":""},null,null,null,{"$f":"IF(DT$2=1,Klimadaten!DT14,\"\")","v":""},null,null,null,{"$f":"IF(DX$2=1,Klimadaten!DX14,\"\")","v":""},null,null,null,{"$f":"IF(EB$2=1,Klimadaten!EB14,\"\")","v":""},null,null,null,{"$f":"IF(EF$2=1,Klimadaten!EF14,\"\")","v":""},null,null,null,{"$f":"IF(EJ$2=1,Klimadaten!EJ14,\"\")","v":""},null,null,null,{"$f":"IF(EN$2=1,Klimadaten!EN14,\"\")","v":""},null,null,null,{"$f":"IF(ER$2=1,Klimadaten!ER14,\"\")","v":""},null,null,null,{"$f":"IF(EV$2=1,Klimadaten!EV14,\"\")","v":""},null,null,null,{"$f":"IF(EZ$2=1,Klimadaten!EZ14,\"\")","v":""},null,null,null,{"$f":"IF(FD$2=1,Klimadaten!FD14,\"\")","v":""},null,null,null,{"$f":"IF(FH$2=1,Klimadaten!FH14,\"\")","v":""},null,null,null,{"$f":"IF(FL$2=1,Klimadaten!FL14,\"\")","v":""},null,null,null,{"$f":"IF(FP$2=1,Klimadaten!FP14,\"\")","v":""},null,null,null,{"$f":"IF(FT$2=1,Klimadaten!FT14,\"\")","v":""},null,null,null,{"$f":"IF(FX$2=1,Klimadaten!FX14,\"\")","v":""},null,null,null,{"$f":"IF(GB$2=1,Klimadaten!GB14,\"\")","v":""},null,null,null,{"$f":"IF(GF$2=1,Klimadaten!GF14,\"\")","v":""},null,null,null,{"$f":"IF(GJ$2=1,Klimadaten!GJ14,\"\")","v":""},null,null,null,{"$f":"IF(GN$2=1,Klimadaten!GN14,\"\")","v":""},null,null,null,{"$f":"IF(GR$2=1,Klimadaten!GR14,\"\")","v":""},null,null,null,{"$f":"IF(GV$2=1,Klimadaten!GV14,\"\")","v":""},null,null,null,{"$f":"IF(GZ$2=1,Klimadaten!GZ14,\"\")","v":""},null,null,null,{"$f":"IF(HD$2=1,Klimadaten!HD14,\"\")","v":""},null,null,null,{"$f":"IF(HH$2=1,Klimadaten!HH14,\"\")","v":""},null,null,null,{"$f":"IF(HL$2=1,Klimadaten!HL14,\"\")","v":2},null,null,null,null,null,null,null,null,null,null,null,null,null,null,null,null,null,null,null,{"$f":"IF(IF$2=1,Klimadaten!IF14,\"\")","v":""},null,null,null,{"$f":"IF(IJ$2=1,Klimadaten!IJ14,\"\")","v":""},null,null,null,{"$f":"IF(IN$2=1,Klimadaten!IN14,\"\")","v":""},null,null,null,{"$f":"IF(IR$2=1,Klimadaten!IR14,\"\")","v":""},null,null,null,{"$f":"IF(IV$2=1,Klimadaten!IV14,\"\")","v":""}]
[-15,null,null,{"$f":"IF(D$2=1,Klimadaten!D15,\"\")","v":""},null,null,null,{"$f":"IF(H$2=1,Klimadaten!H15,\"\")","v":0},null,null,null,{"$f":"IF(L$2=1,Klimadaten!L15,\"\")","v":0},null,null,null,{"$f":"IF(P$2=1,Klimadaten!P15,\"\")","v":""},null,null,null,{"$f":"IF(T$2=1,Klimadaten!T15,\"\")","v":""},null,null,null,{"$f":"IF(X$2=1,Klimadaten!X15,\"\")","v":""},null,null,null,{"$f":"IF(AB$2=1,Klimadaten!AB15,\"\")","v":""},null,null,null,{"$f":"IF(AF$2=1,Klimadaten!AF15,\"\")","v":""},null,null,null,{"$f":"IF(AJ$2=1,Klimadaten!AJ15,\"\")","v":""},null,null,null,{"$f":"IF(AN$2=1,Klimadaten!AN15,\"\")","v":""},null,null,null,{"$f":"IF(AR$2=1,Klimadaten!AR15,\"\")","v":""},null,null,null,{"$f":"IF(AV$2=1,Klimadaten!AV15,\"\")","v":""},null,null,null,{"$f":"IF(AZ$2=1,Klimadaten!AZ15,\"\")","v":""},null,null,null,{"$f":"IF(BD$2=1,Klimadaten!BD15,\"\")","v":""},null,null,null,{"$f":"IF(BH$2=1,Klimadaten!BH15,\"\")","v":""},null,null,null,{"$f":"IF(BL$2=1,Klimadaten!BL15,\"\")","v":""},null,null,null,{"$f":"IF(BP$2=1,Klimadaten!BP15,\"\")","v":""},null,null,null,{"$f":"IF(BT$2=1,Klimadaten!BT15,\"\")","v":""},null,null,null,{"$f":"IF(BX$2=1,Klimadaten!BX15,\"\")","v":""},null,null,null,{"$f":"IF(CB$2=1,Klimadaten!CB15,\"\")","v":""},null,null,null,{"$f":"IF(CF$2=1,Klimadaten!CF15,\"\")","v":""},null,null,null,{"$f":"IF(CJ$2=1,Klimadaten!CJ15,\"\")","v":""},null,null,null,{"$f":"IF(CN$2=1,Klimadaten!CN15,\"\")","v":""},null,null,null,{"$f":"IF(CR$2=1,Klimadaten!CR15,\"\")","v":0},null,null,null,{"$f":"IF(CV$2=1,Klimadaten!CV15,\"\")","v":""},null,null,null,{"$f":"IF(CZ$2=1,Klimadaten!CZ15,\"\")","v":""},null,null,null,{"$f":"IF(DD$2=1,Klimadaten!DD15,\"\")","v":""},null,null,null,{"$f":"IF(DH$2=1,Klimadaten!DH15,\"\")","v":""},null,null,null,{"$f":"IF(DL$2=1,Klimadaten!DL15,\"\")","v":""},null,null,null,{"$f":"IF(DP$2=1,Klimadaten!DP15,\"\")","v":""},null,null,null,{"$f":"IF(DT$2=1,Klimadaten!DT15,\"\")","v":""},null,null,null,{"$f":"IF(DX$2=1,Klimadaten!DX15,\"\")","v":""},null,null,null,{"$f":"IF(EB$2=1,Klimadaten!EB15,\"\")","v":""},null,null,null,{"$f":"IF(EF$2=1,Klimadaten!EF15,\"\")","v":""},null,null,null,{"$f":"IF(EJ$2=1,Klimadaten!EJ15,\"\")","v":""},null,null,null,{"$f":"IF(EN$2=1,Klimadaten!EN15,\"\")","v":""},null,null,null,{"$f":"IF(ER$2=1,Klimadaten!ER15,\"\")","v":""},null,null,null,{"$f":"IF(EV$2=1,Klimadaten!EV15,\"\")","v":""},null,null,null,{"$f":"IF(EZ$2=1,Klimadaten!EZ15,\"\")","v":""},null,null,null,{"$f":"IF(FD$2=1,Klimadaten!FD15,\"\")","v":""},null,null,null,{"$f":"IF(FH$2=1,Klimadaten!FH15,\"\")","v":""},null,null,null,{"$f":"IF(FL$2=1,Klimadaten!FL15,\"\")","v":""},null,null,null,{"$f":"IF(FP$2=1,Klimadaten!FP15,\"\")","v":""},null,null,null,{"$f":"IF(FT$2=1,Klimadaten!FT15,\"\")","v":""},null,null,null,{"$f":"IF(FX$2=1,Klimadaten!FX15,\"\")","v":""},null,null,null,{"$f":"IF(GB$2=1,Klimadaten!GB15,\"\")","v":""},null,null,null,{"$f":"IF(GF$2=1,Klimadaten!GF15,\"\")","v":""},null,null,null,{"$f":"IF(GJ$2=1,Klimadaten!GJ15,\"\")","v":""},null,null,null,{"$f":"IF(GN$2=1,Klimadaten!GN15,\"\")","v":""},null,null,null,{"$f":"IF(GR$2=1,Klimadaten!GR15,\"\")","v":""},null,null,null,{"$f":"IF(GV$2=1,Klimadaten!GV15,\"\")","v":""},null,null,null,{"$f":"IF(GZ$2=1,Klimadaten!GZ15,\"\")","v":""},null,null,null,{"$f":"IF(HD$2=1,Klimadaten!HD15,\"\")","v":""},null,null,null,{"$f":"IF(HH$2=1,Klimadaten!HH15,\"\")","v":""},null,null,null,{"$f":"IF(HL$2=1,Klimadaten!HL15,\"\")","v":2},null,null,null,null,null,null,null,null,null,null,null,null,null,null,null,null,null,null,null,{"$f":"IF(IF$2=1,Klimadaten!IF15,\"\")","v":""},null,null,null,{"$f":"IF(IJ$2=1,Klimadaten!IJ15,\"\")","v":""},null,null,null,{"$f":"IF(IN$2=1,Klimadaten!IN15,\"\")","v":""},null,null,null,{"$f":"IF(IR$2=1,Klimadaten!IR15,\"\")","v":""},null,null,null,{"$f":"IF(IV$2=1,Klimadaten!IV15,\"\")","v":""}]
[-14,null,null,{"$f":"IF(D$2=1,Klimadaten!D16,\"\")","v":""},null,null,null,{"$f":"IF(H$2=1,Klimadaten!H16,\"\")","v":0},null,null,null,{"$f":"IF(L$2=1,Klimadaten!L16,\"\")","v":0},null,null,null,{"$f":"IF(P$2=1,Klimadaten!P16,\"\")","v":""},null,null,null,{"$f":"IF(T$2=1,Klimadaten!T16,\"\")","v":""},null,null,null,{"$f":"IF(X$2=1,Klimadaten!X16,\"\")","v":""},null,null,null,{"$f":"IF(AB$2=1,Klimadaten!AB16,\"\")","v":""},null,null,null,{"$f":"IF(AF$2=1,Klimadaten!AF16,\"\")","v":""},null,null,null,{"$f":"IF(AJ$2=1,Klimadaten!AJ16,\"\")","v":""},null,null,null,{"$f":"IF(AN$2=1,Klimadaten!AN16,\"\")","v":""},null,null,null,{"$f":"IF(AR$2=1,Klimadaten!AR16,\"\")","v":""},null,null,null,{"$f":"IF(AV$2=1,Klimadaten!AV16,\"\")","v":""},null,null,null,{"$f":"IF(AZ$2=1,Klimadaten!AZ16,\"\")","v":""},null,null,null,{"$f":"IF(BD$2=1,Klimadaten!BD16,\"\")","v":""},null,null,null,{"$f":"IF(BH$2=1,Klimadaten!BH16,\"\")","v":""},null,null,null,{"$f":"IF(BL$2=1,Klimadaten!BL16,\"\")","v":""},null,null,null,{"$f":"IF(BP$2=1,Klimadaten!BP16,\"\")","v":""},null,null,null,{"$f":"IF(BT$2=1,Klimadaten!BT16,\"\")","v":""},null,null,null,{"$f":"IF(BX$2=1,Klimadaten!BX16,\"\")","v":""},null,null,null,{"$f":"IF(CB$2=1,Klimadaten!CB16,\"\")","v":""},null,null,null,{"$f":"IF(CF$2=1,Klimadaten!CF16,\"\")","v":""},null,null,null,{"$f":"IF(CJ$2=1,Klimadaten!CJ16,\"\")","v":""},null,null,null,{"$f":"IF(CN$2=1,Klimadaten!CN16,\"\")","v":""},null,null,null,{"$f":"IF(CR$2=1,Klimadaten!CR16,\"\")","v":0},null,null,null,{"$f":"IF(CV$2=1,Klimadaten!CV16,\"\")","v":""},null,null,null,{"$f":"IF(CZ$2=1,Klimadaten!CZ16,\"\")","v":""},null,null,null,{"$f":"IF(DD$2=1,Klimadaten!DD16,\"\")","v":""},null,null,null,{"$f":"IF(DH$2=1,Klimadaten!DH16,\"\")","v":""},null,null,null,{"$f":"IF(DL$2=1,Klimadaten!DL16,\"\")","v":""},null,null,null,{"$f":"IF(DP$2=1,Klimadaten!DP16,\"\")","v":""},null,null,null,{"$f":"IF(DT$2=1,Klimadaten!DT16,\"\")","v":""},null,null,null,{"$f":"IF(DX$2=1,Klimadaten!DX16,\"\")","v":""},null,null,null,{"$f":"IF(EB$2=1,Klimadaten!EB16,\"\")","v":""},null,null,null,{"$f":"IF(EF$2=1,Klimadaten!EF16,\"\")","v":""},null,null,null,{"$f":"IF(EJ$2=1,Klimadaten!EJ16,\"\")","v":""},null,null,null,{"$f":"IF(EN$2=1,Klimadaten!EN16,\"\")","v":""},null,null,null,{"$f":"IF(ER$2=1,Klimadaten!ER16,\"\")","v":""},null,null,null,{"$f":"IF(EV$2=1,Klimadaten!EV16,\"\")","v":""},null,null,null,{"$f":"IF(EZ$2=1,Klimadaten!EZ16,\"\")","v":""},null,null,null,{"$f":"IF(FD$2=1,Klimadaten!FD16,\"\")","v":""},null,null,null,{"$f":"IF(FH$2=1,Klimadaten!FH16,\"\")","v":""},null,null,null,{"$f":"IF(FL$2=1,Klimadaten!FL16,\"\")","v":""},null,null,null,{"$f":"IF(FP$2=1,Klimadaten!FP16,\"\")","v":""},null,null,null,{"$f":"IF(FT$2=1,Klimadaten!FT16,\"\")","v":""},null,null,null,{"$f":"IF(FX$2=1,Klimadaten!FX16,\"\")","v":""},null,null,null,{"$f":"IF(GB$2=1,Klimadaten!GB16,\"\")","v":""},null,null,null,{"$f":"IF(GF$2=1,Klimadaten!GF16,\"\")","v":""},null,null,null,{"$f":"IF(GJ$2=1,Klimadaten!GJ16,\"\")","v":""},null,null,null,{"$f":"IF(GN$2=1,Klimadaten!GN16,\"\")","v":""},null,null,null,{"$f":"IF(GR$2=1,Klimadaten!GR16,\"\")","v":""},null,null,null,{"$f":"IF(GV$2=1,Klimadaten!GV16,\"\")","v":""},null,null,null,{"$f":"IF(GZ$2=1,Klimadaten!GZ16,\"\")","v":""},null,null,null,{"$f":"IF(HD$2=1,Klimadaten!HD16,\"\")","v":""},null,null,null,{"$f":"IF(HH$2=1,Klimadaten!HH16,\"\")","v":""},null,null,null,{"$f":"IF(HL$2=1,Klimadaten!HL16,\"\")","v":3},null,null,null,null,null,null,null,null,null,null,null,null,null,null,null,null,null,null,null,{"$f":"IF(IF$2=1,Klimadaten!IF16,\"\")","v":""},null,null,null,{"$f":"IF(IJ$2=1,Klimadaten!IJ16,\"\")","v":""},null,null,null,{"$f":"IF(IN$2=1,Klimadaten!IN16,\"\")","v":""},null,null,null,{"$f":"IF(IR$2=1,Klimadaten!IR16,\"\")","v":""},null,null,null,{"$f":"IF(IV$2=1,Klimadaten!IV16,\"\")","v":""}]
[-13,null,null,{"$f":"IF(D$2=1,Klimadaten!D17,\"\")","v":""},null,null,null,{"$f":"IF(H$2=1,Klimadaten!H17,\"\")","v":0},null,null,null,{"$f":"IF(L$2=1,Klimadaten!L17,\"\")","v":0},null,null,null,{"$f":"IF(P$2=1,Klimadaten!P17,\"\")","v":""},null,null,null,{"$f":"IF(T$2=1,Klimadaten!T17,\"\")","v":""},null,null,null,{"$f":"IF(X$2=1,Klimadaten!X17,\"\")","v":""},null,null,null,{"$f":"IF(AB$2=1,Klimadaten!AB17,\"\")","v":""},null,null,null,{"$f":"IF(AF$2=1,Klimadaten!AF17,\"\")","v":""},null,null,null,{"$f":"IF(AJ$2=1,Klimadaten!AJ17,\"\")","v":""},null,null,null,{"$f":"IF(AN$2=1,Klimadaten!AN17,\"\")","v":""},null,null,null,{"$f":"IF(AR$2=1,Klimadaten!AR17,\"\")","v":""},null,null,null,{"$f":"IF(AV$2=1,Klimadaten!AV17,\"\")","v":""},null,null,null,{"$f":"IF(AZ$2=1,Klimadaten!AZ17,\"\")","v":""},null,null,null,{"$f":"IF(BD$2=1,Klimadaten!BD17,\"\")","v":""},null,null,null,{"$f":"IF(BH$2=1,Klimadaten!BH17,\"\")","v":""},null,null,null,{"$f":"IF(BL$2=1,Klimadaten!BL17,\"\")","v":""},null,null,null,{"$f":"IF(BP$2=1,Klimadaten!BP17,\"\")","v":""},null,null,null,{"$f":"IF(BT$2=1,Klimadaten!BT17,\"\")","v":""},null,null,null,{"$f":"IF(BX$2=1,Klimadaten!BX17,\"\")","v":""},null,null,null,{"$f":"IF(CB$2=1,Klimadaten!CB17,\"\")","v":""},null,null,null,{"$f":"IF(CF$2=1,Klimadaten!CF17,\"\")","v":""},null,null,null,{"$f":"IF(CJ$2=1,Klimadaten!CJ17,\"\")","v":""},null,null,null,{"$f":"IF(CN$2=1,Klimadaten!CN17,\"\")","v":""},null,null,null,{"$f":"IF(CR$2=1,Klimadaten!CR17,\"\")","v":0},null,null,null,{"$f":"IF(CV$2=1,Klimadaten!CV17,\"\")","v":""},null,null,null,{"$f":"IF(CZ$2=1,Klimadaten!CZ17,\"\")","v":""},null,null,null,{"$f":"IF(DD$2=1,Klimadaten!DD17,\"\")","v":""},null,null,null,{"$f":"IF(DH$2=1,Klimadaten!DH17,\"\")","v":""},null,null,null,{"$f":"IF(DL$2=1,Klimadaten!DL17,\"\")","v":""},null,null,null,{"$f":"IF(DP$2=1,Klimadaten!DP17,\"\")","v":""},null,null,null,{"$f":"IF(DT$2=1,Klimadaten!DT17,\"\")","v":""},null,null,null,{"$f":"IF(DX$2=1,Klimadaten!DX17,\"\")","v":""},null,null,null,{"$f":"IF(EB$2=1,Klimadaten!EB17,\"\")","v":""},null,null,null,{"$f":"IF(EF$2=1,Klimadaten!EF17,\"\")","v":""},null,null,null,{"$f":"IF(EJ$2=1,Klimadaten!EJ17,\"\")","v":""},null,null,null,{"$f":"IF(EN$2=1,Klimadaten!EN17,\"\")","v":""},null,null,null,{"$f":"IF(ER$2=1,Klimadaten!ER17,\"\")","v":""},null,null,null,{"$f":"IF(EV$2=1,Klimadaten!EV17,\"\")","v":""},null,null,null,{"$f":"IF(EZ$2=1,Klimadaten!EZ17,\"\")","v":""},null,null,null,{"$f":"IF(FD$2=1,Klimadaten!FD17,\"\")","v":""},null,null,null,{"$f":"IF(FH$2=1,Klimadaten!FH17,\"\")","v":""},null,null,null,{"$f":"IF(FL$2=1,Klimadaten!FL17,\"\")","v":""},null,null,null,{"$f":"IF(FP$2=1,Klimadaten!FP17,\"\")","v":""},null,null,null,{"$f":"IF(FT$2=1,Klimadaten!FT17,\"\")","v":""},null,null,null,{"$f":"IF(FX$2=1,Klimadaten!FX17,\"\")","v":""},null,null,null,{"$f":"IF(GB$2=1,Klimadaten!GB17,\"\")","v":""},null,null,null,{"$f":"IF(GF$2=1,Klimadaten!GF17,\"\")","v":""},null,null,null,{"$f":"IF(GJ$2=1,Klimadaten!GJ17,\"\")","v":""},null,null,null,{"$f":"IF(GN$2=1,Klimadaten!GN17,\"\")","v":""},null,null,null,{"$f":"IF(GR$2=1,Klimadaten!GR17,\"\")","v":""},null,null,null,{"$f":"IF(GV$2=1,Klimadaten!GV17,\"\")","v":""},null,null,null,{"$f":"IF(GZ$2=1,Klimadaten!GZ17,\"\")","v":""},null,null,null,{"$f":"IF(HD$2=1,Klimadaten!HD17,\"\")","v":""},null,null,null,{"$f":"IF(HH$2=1,Klimadaten!HH17,\"\")","v":""},null,null,null,{"$f":"IF(HL$2=1,Klimadaten!HL17,\"\")","v":4},null,null,null,null,null,null,null,null,null,null,null,null,null,null,null,null,null,null,null,{"$f":"IF(IF$2=1,Klimadaten!IF17,\"\")","v":""},null,null,null,{"$f":"IF(IJ$2=1,Klimadaten!IJ17,\"\")","v":""},null,null,null,{"$f":"IF(IN$2=1,Klimadaten!IN17,\"\")","v":""},null,null,null,{"$f":"IF(IR$2=1,Klimadaten!IR17,\"\")","v":""},null,null,null,{"$f":"IF(IV$2=1,Klimadaten!IV17,\"\")","v":""}]
[-12,null,null,{"$f":"IF(D$2=1,Klimadaten!D18,\"\")","v":""},null,null,null,{"$f":"IF(H$2=1,Klimadaten!H18,\"\")","v":0},null,null,null,{"$f":"IF(L$2=1,Klimadaten!L18,\"\")","v":0},null,null,null,{"$f":"IF(P$2=1,Klimadaten!P18,\"\")","v":""},null,null,null,{"$f":"IF(T$2=1,Klimadaten!T18,\"\")","v":""},null,null,null,{"$f":"IF(X$2=1,Klimadaten!X18,\"\")","v":""},null,null,null,{"$f":"IF(AB$2=1,Klimadaten!AB18,\"\")","v":""},null,null,null,{"$f":"IF(AF$2=1,Klimadaten!AF18,\"\")","v":""},null,null,null,{"$f":"IF(AJ$2=1,Klimadaten!AJ18,\"\")","v":""},null,null,null,{"$f":"IF(AN$2=1,Klimadaten!AN18,\"\")","v":""},null,null,null,{"$f":"IF(AR$2=1,Klimadaten!AR18,\"\")","v":""},null,null,null,{"$f":"IF(AV$2=1,Klimadaten!AV18,\"\")","v":""},null,null,null,{"$f":"IF(AZ$2=1,Klimadaten!AZ18,\"\")","v":""},null,null,null,{"$f":"IF(BD$2=1,Klimadaten!BD18,\"\")","v":""},null,null,null,{"$f":"IF(BH$2=1,Klimadaten!BH18,\"\")","v":""},null,null,null,{"$f":"IF(BL$2=1,Klimadaten!BL18,\"\")","v":""},null,null,null,{"$f":"IF(BP$2=1,Klimadaten!BP18,\"\")","v":""},null,null,null,{"$f":"IF(BT$2=1,Klimadaten!BT18,\"\")","v":""},null,null,null,{"$f":"IF(BX$2=1,Klimadaten!BX18,\"\")","v":""},null,null,null,{"$f":"IF(CB$2=1,Klimadaten!CB18,\"\")","v":""},null,null,null,{"$f":"IF(CF$2=1,Klimadaten!CF18,\"\")","v":""},null,null,null,{"$f":"IF(CJ$2=1,Klimadaten!CJ18,\"\")","v":""},null,null,null,{"$f":"IF(CN$2=1,Klimadaten!CN18,\"\")","v":""},null,null,null,{"$f":"IF(CR$2=1,Klimadaten!CR18,\"\")","v":0},null,null,null,{"$f":"IF(CV$2=1,Klimadaten!CV18,\"\")","v":""},null,null,null,{"$f":"IF(CZ$2=1,Klimadaten!CZ18,\"\")","v":""},null,null,null,{"$f":"IF(DD$2=1,Klimadaten!DD18,\"\")","v":""},null,null,null,{"$f":"IF(DH$2=1,Klimadaten!DH18,\"\")","v":""},null,null,null,{"$f":"IF(DL$2=1,Klimadaten!DL18,\"\")","v":""},null,null,null,{"$f":"IF(DP$2=1,Klimadaten!DP18,\"\")","v":""},null,null,null,{"$f":"IF(DT$2=1,Klimadaten!DT18,\"\")","v":""},null,null,null,{"$f":"IF(DX$2=1,Klimadaten!DX18,\"\")","v":""},null,null,null,{"$f":"IF(EB$2=1,Klimadaten!EB18,\"\")","v":""},null,null,null,{"$f":"IF(EF$2=1,Klimadaten!EF18,\"\")","v":""},null,null,null,{"$f":"IF(EJ$2=1,Klimadaten!EJ18,\"\")","v":""},null,null,null,{"$f":"IF(EN$2=1,Klimadaten!EN18,\"\")","v":""},null,null,null,{"$f":"IF(ER$2=1,Klimadaten!ER18,\"\")","v":""},null,null,null,{"$f":"IF(EV$2=1,Klimadaten!EV18,\"\")","v":""},null,null,null,{"$f":"IF(EZ$2=1,Klimadaten!EZ18,\"\")","v":""},null,null,null,{"$f":"IF(FD$2=1,Klimadaten!FD18,\"\")","v":""},null,null,null,{"$f":"IF(FH$2=1,Klimadaten!FH18,\"\")","v":""},null,null,null,{"$f":"IF(FL$2=1,Klimadaten!FL18,\"\")","v":""},null,null,null,{"$f":"IF(FP$2=1,Klimadaten!FP18,\"\")","v":""},null,null,null,{"$f":"IF(FT$2=1,Klimadaten!FT18,\"\")","v":""},null,null,null,{"$f":"IF(FX$2=1,Klimadaten!FX18,\"\")","v":""},null,null,null,{"$f":"IF(GB$2=1,Klimadaten!GB18,\"\")","v":""},null,null,null,{"$f":"IF(GF$2=1,Klimadaten!GF18,\"\")","v":""},null,null,null,{"$f":"IF(GJ$2=1,Klimadaten!GJ18,\"\")","v":""},null,null,null,{"$f":"IF(GN$2=1,Klimadaten!GN18,\"\")","v":""},null,null,null,{"$f":"IF(GR$2=1,Klimadaten!GR18,\"\")","v":""},null,null,null,{"$f":"IF(GV$2=1,Klimadaten!GV18,\"\")","v":""},null,null,null,{"$f":"IF(GZ$2=1,Klimadaten!GZ18,\"\")","v":""},null,null,null,{"$f":"IF(HD$2=1,Klimadaten!HD18,\"\")","v":""},null,null,null,{"$f":"IF(HH$2=1,Klimadaten!HH18,\"\")","v":""},null,null,null,{"$f":"IF(HL$2=1,Klimadaten!HL18,\"\")","v":4},null,null,null,null,null,null,null,null,null,null,null,null,null,null,null,null,null,null,null,{"$f":"IF(IF$2=1,Klimadaten!IF18,\"\")","v":""},null,null,null,{"$f":"IF(IJ$2=1,Klimadaten!IJ18,\"\")","v":""},null,null,null,{"$f":"IF(IN$2=1,Klimadaten!IN18,\"\")","v":""},null,null,null,{"$f":"IF(IR$2=1,Klimadaten!IR18,\"\")","v":""},null,null,null,{"$f":"IF(IV$2=1,Klimadaten!IV18,\"\")","v":""}]
[-11,null,null,{"$f":"IF(D$2=1,Klimadaten!D19,\"\")","v":""},null,null,null,{"$f":"IF(H$2=1,Klimadaten!H19,\"\")","v":0},null,null,null,{"$f":"IF(L$2=1,Klimadaten!L19,\"\")","v":0},null,null,null,{"$f":"IF(P$2=1,Klimadaten!P19,\"\")","v":""},null,null,null,{"$f":"IF(T$2=1,Klimadaten!T19,\"\")","v":""},null,null,null,{"$f":"IF(X$2=1,Klimadaten!X19,\"\")","v":""},null,null,null,{"$f":"IF(AB$2=1,Klimadaten!AB19,\"\")","v":""},null,null,null,{"$f":"IF(AF$2=1,Klimadaten!AF19,\"\")","v":""},null,null,null,{"$f":"IF(AJ$2=1,Klimadaten!AJ19,\"\")","v":""},null,null,null,{"$f":"IF(AN$2=1,Klimadaten!AN19,\"\")","v":""},null,null,null,{"$f":"IF(AR$2=1,Klimadaten!AR19,\"\")","v":""},null,null,null,{"$f":"IF(AV$2=1,Klimadaten!AV19,\"\")","v":""},null,null,null,{"$f":"IF(AZ$2=1,Klimadaten!AZ19,\"\")","v":""},null,null,null,{"$f":"IF(BD$2=1,Klimadaten!BD19,\"\")","v":""},null,null,null,{"$f":"IF(BH$2=1,Klimadaten!BH19,\"\")","v":""},null,null,null,{"$f":"IF(BL$2=1,Klimadaten!BL19,\"\")","v":""},null,null,null,{"$f":"IF(BP$2=1,Klimadaten!BP19,\"\")","v":""},null,null,null,{"$f":"IF(BT$2=1,Klimadaten!BT19,\"\")","v":""},null,null,null,{"$f":"IF(BX$2=1,Klimadaten!BX19,\"\")","v":""},null,null,null,{"$f":"IF(CB$2=1,Klimadaten!CB19,\"\")","v":""},null,null,null,{"$f":"IF(CF$2=1,Klimadaten!CF19,\"\")","v":""},null,null,null,{"$f":"IF(CJ$2=1,Klimadaten!CJ19,\"\")","v":""},null,null,null,{"$f":"IF(CN$2=1,Klimadaten!CN19,\"\")","v":""},null,null,null,{"$f":"IF(CR$2=1,Klimadaten!CR19,\"\")","v":1},null,null,null,{"$f":"IF(CV$2=1,Klimadaten!CV19,\"\")","v":""},null,null,null,{"$f":"IF(CZ$2=1,Klimadaten!CZ19,\"\")","v":""},null,null,null,{"$f":"IF(DD$2=1,Klimadaten!DD19,\"\")","v":""},null,null,null,{"$f":"IF(DH$2=1,Klimadaten!DH19,\"\")","v":""},null,null,null,{"$f":"IF(DL$2=1,Klimadaten!DL19,\"\")","v":""},null,null,null,{"$f":"IF(DP$2=1,Klimadaten!DP19,\"\")","v":""},null,null,null,{"$f":"IF(DT$2=1,Klimadaten!DT19,\"\")","v":""},null,null,null,{"$f":"IF(DX$2=1,Klimadaten!DX19,\"\")","v":""},null,null,null,{"$f":"IF(EB$2=1,Klimadaten!EB19,\"\")","v":""},null,null,null,{"$f":"IF(EF$2=1,Klimadaten!EF19,\"\")","v":""},null,null,null,{"$f":"IF(EJ$2=1,Klimadaten!EJ19,\"\")","v":""},null,null,null,{"$f":"IF(EN$2=1,Klimadaten!EN19,\"\")","v":""},null,null,null,{"$f":"IF(ER$2=1,Klimadaten!ER19,\"\")","v":""},null,null,null,{"$f":"IF(EV$2=1,Klimadaten!EV19,\"\")","v":""},null,null,null,{"$f":"IF(EZ$2=1,Klimadaten!EZ19,\"\")","v":""},null,null,null,{"$f":"IF(FD$2=1,Klimadaten!FD19,\"\")","v":""},null,null,null,{"$f":"IF(FH$2=1,Klimadaten!FH19,\"\")","v":""},null,null,null,{"$f":"IF(FL$2=1,Klimadaten!FL19,\"\")","v":""},null,null,null,{"$f":"IF(FP$2=1,Klimadaten!FP19,\"\")","v":""},null,null,null,{"$f":"IF(FT$2=1,Klimadaten!FT19,\"\")","v":""},null,null,null,{"$f":"IF(FX$2=1,Klimadaten!FX19,\"\")","v":""},null,null,null,{"$f":"IF(GB$2=1,Klimadaten!GB19,\"\")","v":""},null,null,null,{"$f":"IF(GF$2=1,Klimadaten!GF19,\"\")","v":""},null,null,null,{"$f":"IF(GJ$2=1,Klimadaten!GJ19,\"\")","v":""},null,null,null,{"$f":"IF(GN$2=1,Klimadaten!GN19,\"\")","v":""},null,null,null,{"$f":"IF(GR$2=1,Klimadaten!GR19,\"\")","v":""},null,null,null,{"$f":"IF(GV$2=1,Klimadaten!GV19,\"\")","v":""},null,null,null,{"$f":"IF(GZ$2=1,Klimadaten!GZ19,\"\")","v":""},null,null,null,{"$f":"IF(HD$2=1,Klimadaten!HD19,\"\")","v":""},null,null,null,{"$f":"IF(HH$2=1,Klimadaten!HH19,\"\")","v":""},null,null,null,{"$f":"IF(HL$2=1,Klimadaten!HL19,\"\")","v":4},null,null,null,null,null,null,null,null,null,null,null,null,null,null,null,null,null,null,null,{"$f":"IF(IF$2=1,Klimadaten!IF19,\"\")","v":""},null,null,null,{"$f":"IF(IJ$2=1,Klimadaten!IJ19,\"\")","v":""},null,null,null,{"$f":"IF(IN$2=1,Klimadaten!IN19,\"\")","v":""},null,null,null,{"$f":"IF(IR$2=1,Klimadaten!IR19,\"\")","v":""},null,null,null,{"$f":"IF(IV$2=1,Klimadaten!IV19,\"\")","v":""}]
[-10,null,null,{"$f":"IF(D$2=1,Klimadaten!D20,\"\")","v":""},null,null,null,{"$f":"IF(H$2=1,Klimadaten!H20,\"\")","v":0},null,null,null,{"$f":"IF(L$2=1,Klimadaten!L20,\"\")","v":0},null,null,null,{"$f":"IF(P$2=1,Klimadaten!P20,\"\")","v":""},null,null,null,{"$f":"IF(T$2=1,Klimadaten!T20,\"\")","v":""},null,null,null,{"$f":"IF(X$2=1,Klimadaten!X20,\"\")","v":""},null,null,null,{"$f":"IF(AB$2=1,Klimadaten!AB20,\"\")","v":""},null,null,null,{"$f":"IF(AF$2=1,Klimadaten!AF20,\"\")","v":""},null,null,null,{"$f":"IF(AJ$2=1,Klimadaten!AJ20,\"\")","v":""},null,null,null,{"$f":"IF(AN$2=1,Klimadaten!AN20,\"\")","v":""},null,null,null,{"$f":"IF(AR$2=1,Klimadaten!AR20,\"\")","v":""},null,null,null,{"$f":"IF(AV$2=1,Klimadaten!AV20,\"\")","v":""},null,null,null,{"$f":"IF(AZ$2=1,Klimadaten!AZ20,\"\")","v":""},null,null,null,{"$f":"IF(BD$2=1,Klimadaten!BD20,\"\")","v":""},null,null,null,{"$f":"IF(BH$2=1,Klimadaten!BH20,\"\")","v":""},null,null,null,{"$f":"IF(BL$2=1,Klimadaten!BL20,\"\")","v":""},null,null,null,{"$f":"IF(BP$2=1,Klimadaten!BP20,\"\")","v":""},null,null,null,{"$f":"IF(BT$2=1,Klimadaten!BT20,\"\")","v":""},null,null,null,{"$f":"IF(BX$2=1,Klimadaten!BX20,\"\")","v":""},null,null,null,{"$f":"IF(CB$2=1,Klimadaten!CB20,\"\")","v":""},null,null,null,{"$f":"IF(CF$2=1,Klimadaten!CF20,\"\")","v":""},null,null,null,{"$f":"IF(CJ$2=1,Klimadaten!CJ20,\"\")","v":""},null,null,null,{"$f":"IF(CN$2=1,Klimadaten!CN20,\"\")","v":""},null,null,null,{"$f":"IF(CR$2=1,Klimadaten!CR20,\"\")","v":1},null,null,null,{"$f":"IF(CV$2=1,Klimadaten!CV20,\"\")","v":""},null,null,null,{"$f":"IF(CZ$2=1,Klimadaten!CZ20,\"\")","v":""},null,null,null,{"$f":"IF(DD$2=1,Klimadaten!DD20,\"\")","v":""},null,null,null,{"$f":"IF(DH$2=1,Klimadaten!DH20,\"\")","v":""},null,null,null,{"$f":"IF(DL$2=1,Klimadaten!DL20,\"\")","v":""},null,null,null,{"$f":"IF(DP$2=1,Klimadaten!DP20,\"\")","v":""},null,null,null,{"$f":"IF(DT$2=1,Klimadaten!DT20,\"\")","v":""},null,null,null,{"$f":"IF(DX$2=1,Klimadaten!DX20,\"\")","v":""},null,null,null,{"$f":"IF(EB$2=1,Klimadaten!EB20,\"\")","v":""},null,null,null,{"$f":"IF(EF$2=1,Klimadaten!EF20,\"\")","v":""},null,null,null,{"$f":"IF(EJ$2=1,Klimadaten!EJ20,\"\")","v":""},null,null,null,{"$f":"IF(EN$2=1,Klimadaten!EN20,\"\")","v":""},null,null,null,{"$f":"IF(ER$2=1,Klimadaten!ER20,\"\")","v":""},null,null,null,{"$f":"IF(EV$2=1,Klimadaten!EV20,\"\")","v":""},null,null,null,{"$f":"IF(EZ$2=1,Klimadaten!EZ20,\"\")","v":""},null,null,null,{"$f":"IF(FD$2=1,Klimadaten!FD20,\"\")","v":""},null,null,null,{"$f":"IF(FH$2=1,Klimadaten!FH20,\"\")","v":""},null,null,null,{"$f":"IF(FL$2=1,Klimadaten!FL20,\"\")","v":""},null,null,null,{"$f":"IF(FP$2=1,Klimadaten!FP20,\"\")","v":""},null,null,null,{"$f":"IF(FT$2=1,Klimadaten!FT20,\"\")","v":""},null,null,null,{"$f":"IF(FX$2=1,Klimadaten!FX20,\"\")","v":""},null,null,null,{"$f":"IF(GB$2=1,Klimadaten!GB20,\"\")","v":""},null,null,null,{"$f":"IF(GF$2=1,Klimadaten!GF20,\"\")","v":""},null,null,null,{"$f":"IF(GJ$2=1,Klimadaten!GJ20,\"\")","v":""},null,null,null,{"$f":"IF(GN$2=1,Klimadaten!GN20,\"\")","v":""},null,null,null,{"$f":"IF(GR$2=1,Klimadaten!GR20,\"\")","v":""},null,null,null,{"$f":"IF(GV$2=1,Klimadaten!GV20,\"\")","v":""},null,null,null,{"$f":"IF(GZ$2=1,Klimadaten!GZ20,\"\")","v":""},null,null,null,{"$f":"IF(HD$2=1,Klimadaten!HD20,\"\")","v":""},null,null,null,{"$f":"IF(HH$2=1,Klimadaten!HH20,\"\")","v":""},null,null,null,{"$f":"IF(HL$2=1,Klimadaten!HL20,\"\")","v":5},null,null,null,null,null,null,null,null,null,null,null,null,null,null,null,null,null,null,null,{"$f":"IF(IF$2=1,Klimadaten!IF20,\"\")","v":""},null,null,null,{"$f":"IF(IJ$2=1,Klimadaten!IJ20,\"\")","v":""},null,null,null,{"$f":"IF(IN$2=1,Klimadaten!IN20,\"\")","v":""},null,null,null,{"$f":"IF(IR$2=1,Klimadaten!IR20,\"\")","v":""},null,null,null,{"$f":"IF(IV$2=1,Klimadaten!IV20,\"\")","v":""}]
[-9,null,null,{"$f":"IF(D$2=1,Klimadaten!D21,\"\")","v":""},null,null,null,{"$f":"IF(H$2=1,Klimadaten!H21,\"\")","v":0},null,null,null,{"$f":"IF(L$2=1,Klimadaten!L21,\"\")","v":0},null,null,null,{"$f":"IF(P$2=1,Klimadaten!P21,\"\")","v":""},null,null,null,{"$f":"IF(T$2=1,Klimadaten!T21,\"\")","v":""},null,null,null,{"$f":"IF(X$2=1,Klimadaten!X21,\"\")","v":""},null,null,null,{"$f":"IF(AB$2=1,Klimadaten!AB21,\"\")","v":""},null,null,null,{"$f":"IF(AF$2=1,Klimadaten!AF21,\"\")","v":""},null,null,null,{"$f":"IF(AJ$2=1,Klimadaten!AJ21,\"\")","v":""},null,null,null,{"$f":"IF(AN$2=1,Klimadaten!AN21,\"\")","v":""},null,null,null,{"$f":"IF(AR$2=1,Klimadaten!AR21,\"\")","v":""},null,null,null,{"$f":"IF(AV$2=1,Klimadaten!AV21,\"\")","v":""},null,null,null,{"$f":"IF(AZ$2=1,Klimadaten!AZ21,\"\")","v":""},null,null,null,{"$f":"IF(BD$2=1,Klimadaten!BD21,\"\")","v":""},null,null,null,{"$f":"IF(BH$2=1,Klimadaten!BH21,\"\")","v":""},null,null,null,{"$f":"IF(BL$2=1,Klimadaten!BL21,\"\")","v":""},null,null,null,{"$f":"IF(BP$2=1,Klimadaten!BP21,\"\")","v":""},null,null,null,{"$f":"IF(BT$2=1,Klimadaten!BT21,\"\")","v":""},null,null,null,{"$f":"IF(BX$2=1,Klimadaten!BX21,\"\")","v":""},null,null,null,{"$f":"IF(CB$2=1,Klimadaten!CB21,\"\")","v":""},null,null,null,{"$f":"IF(CF$2=1,Klimadaten!CF21,\"\")","v":""},null,null,null,{"$f":"IF(CJ$2=1,Klimadaten!CJ21,\"\")","v":""},null,null,null,{"$f":"IF(CN$2=1,Klimadaten!CN21,\"\")","v":""},null,null,null,{"$f":"IF(CR$2=1,Klimadaten!CR21,\"\")","v":2},null,null,null,{"$f":"IF(CV$2=1,Klimadaten!CV21,\"\")","v":""},null,null,null,{"$f":"IF(CZ$2=1,Klimadaten!CZ21,\"\")","v":""},null,null,null,{"$f":"IF(DD$2=1,Klimadaten!DD21,\"\")","v":""},null,null,null,{"$f":"IF(DH$2=1,Klimadaten!DH21,\"\")","v":""},null,null,null,{"$f":"IF(DL$2=1,Klimadaten!DL21,\"\")","v":""},null,null,null,{"$f":"IF(DP$2=1,Klimadaten!DP21,\"\")","v":""},null,null,null,{"$f":"IF(DT$2=1,Klimadaten!DT21,\"\")","v":""},null,null,null,{"$f":"IF(DX$2=1,Klimadaten!DX21,\"\")","v":""},null,null,null,{"$f":"IF(EB$2=1,Klimadaten!EB21,\"\")","v":""},null,null,null,{"$f":"IF(EF$2=1,Klimadaten!EF21,\"\")","v":""},null,null,null,{"$f":"IF(EJ$2=1,Klimadaten!EJ21,\"\")","v":""},null,null,null,{"$f":"IF(EN$2=1,Klimadaten!EN21,\"\")","v":""},null,null,null,{"$f":"IF(ER$2=1,Klimadaten!ER21,\"\")","v":""},null,null,null,{"$f":"IF(EV$2=1,Klimadaten!EV21,\"\")","v":""},null,null,null,{"$f":"IF(EZ$2=1,Klimadaten!EZ21,\"\")","v":""},null,null,null,{"$f":"IF(FD$2=1,Klimadaten!FD21,\"\")","v":""},null,null,null,{"$f":"IF(FH$2=1,Klimadaten!FH21,\"\")","v":""},null,null,null,{"$f":"IF(FL$2=1,Klimadaten!FL21,\"\")","v":""},null,null,null,{"$f":"IF(FP$2=1,Klimadaten!FP21,\"\")","v":""},null,null,null,{"$f":"IF(FT$2=1,Klimadaten!FT21,\"\")","v":""},null,null,null,{"$f":"IF(FX$2=1,Klimadaten!FX21,\"\")","v":""},null,null,null,{"$f":"IF(GB$2=1,Klimadaten!GB21,\"\")","v":""},null,null,null,{"$f":"IF(GF$2=1,Klimadaten!GF21,\"\")","v":""},null,null,null,{"$f":"IF(GJ$2=1,Klimadaten!GJ21,\"\")","v":""},null,null,null,{"$f":"IF(GN$2=1,Klimadaten!GN21,\"\")","v":""},null,null,null,{"$f":"IF(GR$2=1,Klimadaten!GR21,\"\")","v":""},null,null,null,{"$f":"IF(GV$2=1,Klimadaten!GV21,\"\")","v":""},null,null,null,{"$f":"IF(GZ$2=1,Klimadaten!GZ21,\"\")","v":""},null,null,null,{"$f":"IF(HD$2=1,Klimadaten!HD21,\"\")","v":""},null,null,null,{"$f":"IF(HH$2=1,Klimadaten!HH21,\"\")","v":""},null,null,null,{"$f":"IF(HL$2=1,Klimadaten!HL21,\"\")","v":7},null,null,null,null,null,null,null,null,null,null,null,null,null,null,null,null,null,null,null,{"$f":"IF(IF$2=1,Klimadaten!IF21,\"\")","v":""},null,null,null,{"$f":"IF(IJ$2=1,Klimadaten!IJ21,\"\")","v":""},null,null,null,{"$f":"IF(IN$2=1,Klimadaten!IN21,\"\")","v":""},null,null,null,{"$f":"IF(IR$2=1,Klimadaten!IR21,\"\")","v":""},null,null,null,{"$f":"IF(IV$2=1,Klimadaten!IV21,\"\")","v":""}]
[-8,null,null,{"$f":"IF(D$2=1,Klimadaten!D22,\"\")","v":""},null,null,null,{"$f":"IF(H$2=1,Klimadaten!H22,\"\")","v":0},null,null,null,{"$f":"IF(L$2=1,Klimadaten!L22,\"\")","v":0},null,null,null,{"$f":"IF(P$2=1,Klimadaten!P22,\"\")","v":""},null,null,null,{"$f":"IF(T$2=1,Klimadaten!T22,\"\")","v":""},null,null,null,{"$f":"IF(X$2=1,Klimadaten!X22,\"\")","v":""},null,null,null,{"$f":"IF(AB$2=1,Klimadaten!AB22,\"\")","v":""},null,null,null,{"$f":"IF(AF$2=1,Klimadaten!AF22,\"\")","v":""},null,null,null,{"$f":"IF(AJ$2=1,Klimadaten!AJ22,\"\")","v":""},null,null,null,{"$f":"IF(AN$2=1,Klimadaten!AN22,\"\")","v":""},null,null,null,{"$f":"IF(AR$2=1,Klimadaten!AR22,\"\")","v":""},null,null,null,{"$f":"IF(AV$2=1,Klimadaten!AV22,\"\")","v":""},null,null,null,{"$f":"IF(AZ$2=1,Klimadaten!AZ22,\"\")","v":""},null,null,null,{"$f":"IF(BD$2=1,Klimadaten!BD22,\"\")","v":""},null,null,null,{"$f":"IF(BH$2=1,Klimadaten!BH22,\"\")","v":""},null,null,null,{"$f":"IF(BL$2=1,Klimadaten!BL22,\"\")","v":""},null,null,null,{"$f":"IF(BP$2=1,Klimadaten!BP22,\"\")","v":""},null,null,null,{"$f":"IF(BT$2=1,Klimadaten!BT22,\"\")","v":""},null,null,null,{"$f":"IF(BX$2=1,Klimadaten!BX22,\"\")","v":""},null,null,null,{"$f":"IF(CB$2=1,Klimadaten!CB22,\"\")","v":""},null,null,null,{"$f":"IF(CF$2=1,Klimadaten!CF22,\"\")","v":""},null,null,null,{"$f":"IF(CJ$2=1,Klimadaten!CJ22,\"\")","v":""},null,null,null,{"$f":"IF(CN$2=1,Klimadaten!CN22,\"\")","v":""},null,null,null,{"$f":"IF(CR$2=1,Klimadaten!CR22,\"\")","v":3},null,null,null,{"$f":"IF(CV$2=1,Klimadaten!CV22,\"\")","v":""},null,null,null,{"$f":"IF(CZ$2=1,Klimadaten!CZ22,\"\")","v":""},null,null,null,{"$f":"IF(DD$2=1,Klimadaten!DD22,\"\")","v":""},null,null,null,{"$f":"IF(DH$2=1,Klimadaten!DH22,\"\")","v":""},null,null,null,{"$f":"IF(DL$2=1,Klimadaten!DL22,\"\")","v":""},null,null,null,{"$f":"IF(DP$2=1,Klimadaten!DP22,\"\")","v":""},null,null,null,{"$f":"IF(DT$2=1,Klimadaten!DT22,\"\")","v":""},null,null,null,{"$f":"IF(DX$2=1,Klimadaten!DX22,\"\")","v":""},null,null,null,{"$f":"IF(EB$2=1,Klimadaten!EB22,\"\")","v":""},null,null,null,{"$f":"IF(EF$2=1,Klimadaten!EF22,\"\")","v":""},null,null,null,{"$f":"IF(EJ$2=1,Klimadaten!EJ22,\"\")","v":""},null,null,null,{"$f":"IF(EN$2=1,Klimadaten!EN22,\"\")","v":""},null,null,null,{"$f":"IF(ER$2=1,Klimadaten!ER22,\"\")","v":""},null,null,null,{"$f":"IF(EV$2=1,Klimadaten!EV22,\"\")","v":""},null,null,null,{"$f":"IF(EZ$2=1,Klimadaten!EZ22,\"\")","v":""},null,null,null,{"$f":"IF(FD$2=1,Klimadaten!FD22,\"\")","v":""},null,null,null,{"$f":"IF(FH$2=1,Klimadaten!FH22,\"\")","v":""},null,null,null,{"$f":"IF(FL$2=1,Klimadaten!FL22,\"\")","v":""},null,null,null,{"$f":"IF(FP$2=1,Klimadaten!FP22,\"\")","v":""},null,null,null,{"$f":"IF(FT$2=1,Klimadaten!FT22,\"\")","v":""},null,null,null,{"$f":"IF(FX$2=1,Klimadaten!FX22,\"\")","v":""},null,null,null,{"$f":"IF(GB$2=1,Klimadaten!GB22,\"\")","v":""},null,null,null,{"$f":"IF(GF$2=1,Klimadaten!GF22,\"\")","v":""},null,null,null,{"$f":"IF(GJ$2=1,Klimadaten!GJ22,\"\")","v":""},null,null,null,{"$f":"IF(GN$2=1,Klimadaten!GN22,\"\")","v":""},null,null,null,{"$f":"IF(GR$2=1,Klimadaten!GR22,\"\")","v":""},null,null,null,{"$f":"IF(GV$2=1,Klimadaten!GV22,\"\")","v":""},null,null,null,{"$f":"IF(GZ$2=1,Klimadaten!GZ22,\"\")","v":""},null,null,null,{"$f":"IF(HD$2=1,Klimadaten!HD22,\"\")","v":""},null,null,null,{"$f":"IF(HH$2=1,Klimadaten!HH22,\"\")","v":""},null,null,null,{"$f":"IF(HL$2=1,Klimadaten!HL22,\"\")","v":7},null,null,null,null,null,null,null,null,null,null,null,null,null,null,null,null,null,null,null,{"$f":"IF(IF$2=1,Klimadaten!IF22,\"\")","v":""},null,null,null,{"$f":"IF(IJ$2=1,Klimadaten!IJ22,\"\")","v":""},null,null,null,{"$f":"IF(IN$2=1,Klimadaten!IN22,\"\")","v":""},null,null,null,{"$f":"IF(IR$2=1,Klimadaten!IR22,\"\")","v":""},null,null,null,{"$f":"IF(IV$2=1,Klimadaten!IV22,\"\")","v":""}]
[-7,null,null,{"$f":"IF(D$2=1,Klimadaten!D23,\"\")","v":""},null,null,null,{"$f":"IF(H$2=1,Klimadaten!H23,\"\")","v":1},null,null,null,{"$f":"IF(L$2=1,Klimadaten!L23,\"\")","v":0},null,null,null,{"$f":"IF(P$2=1,Klimadaten!P23,\"\")","v":""},null,null,null,{"$f":"IF(T$2=1,Klimadaten!T23,\"\")","v":""},null,null,null,{"$f":"IF(X$2=1,Klimadaten!X23,\"\")","v":""},null,null,null,{"$f":"IF(AB$2=1,Klimadaten!AB23,\"\")","v":""},null,null,null,{"$f":"IF(AF$2=1,Klimadaten!AF23,\"\")","v":""},null,null,null,{"$f":"IF(AJ$2=1,Klimadaten!AJ23,\"\")","v":""},null,null,null,{"$f":"IF(AN$2=1,Klimadaten!AN23,\"\")","v":""},null,null,null,{"$f":"IF(AR$2=1,Klimadaten!AR23,\"\")","v":""},null,null,null,{"$f":"IF(AV$2=1,Klimadaten!AV23,\"\")","v":""},null,null,null,{"$f":"IF(AZ$2=1,Klimadaten!AZ23,\"\")","v":""},null,null,null,{"$f":"IF(BD$2=1,Klimadaten!BD23,\"\")","v":""},null,null,null,{"$f":"IF(BH$2=1,Klimadaten!BH23,\"\")","v":""},null,null,null,{"$f":"IF(BL$2=1,Klimadaten!BL23,\"\")","v":""},null,null,null,{"$f":"IF(BP$2=1,Klimadaten!BP23,\"\")","v":""},null,null,null,{"$f":"IF(BT$2=1,Klimadaten!BT23,\"\")","v":""},null,null,null,{"$f":"IF(BX$2=1,Klimadaten!BX23,\"\")","v":""},null,null,null,{"$f":"IF(CB$2=1,Klimadaten!CB23,\"\")","v":""},null,null,null,{"$f":"IF(CF$2=1,Klimadaten!CF23,\"\")","v":""},null,null,null,{"$f":"IF(CJ$2=1,Klimadaten!CJ23,\"\")","v":""},null,null,null,{"$f":"IF(CN$2=1,Klimadaten!CN23,\"\")","v":""},null,null,null,{"$f":"IF(CR$2=1,Klimadaten!CR23,\"\")","v":6},null,null,null,{"$f":"IF(CV$2=1,Klimadaten!CV23,\"\")","v":""},null,null,null,{"$f":"IF(CZ$2=1,Klimadaten!CZ23,\"\")","v":""},null,null,null,{"$f":"IF(DD$2=1,Klimadaten!DD23,\"\")","v":""},null,null,null,{"$f":"IF(DH$2=1,Klimadaten!DH23,\"\")","v":""},null,null,null,{"$f":"IF(DL$2=1,Klimadaten!DL23,\"\")","v":""},null,null,null,{"$f":"IF(DP$2=1,Klimadaten!DP23,\"\")","v":""},null,null,null,{"$f":"IF(DT$2=1,Klimadaten!DT23,\"\")","v":""},null,null,null,{"$f":"IF(DX$2=1,Klimadaten!DX23,\"\")","v":""},null,null,null,{"$f":"IF(EB$2=1,Klimadaten!EB23,\"\")","v":""},null,null,null,{"$f":"IF(EF$2=1,Klimadaten!EF23,\"\")","v":""},null,null,null,{"$f":"IF(EJ$2=1,Klimadaten!EJ23,\"\")","v":""},null,null,null,{"$f":"IF(EN$2=1,Klimadaten!EN23,\"\")","v":""},null,null,null,{"$f":"IF(ER$2=1,Klimadaten!ER23,\"\")","v":""},null,null,null,{"$f":"IF(EV$2=1,Klimadaten!EV23,\"\")","v":""},null,null,null,{"$f":"IF(EZ$2=1,Klimadaten!EZ23,\"\")","v":""},null,null,null,{"$f":"IF(FD$2=1,Klimadaten!FD23,\"\")","v":""},null,null,null,{"$f":"IF(FH$2=1,Klimadaten!FH23,\"\")","v":""},null,null,null,{"$f":"IF(FL$2=1,Klimadaten!FL23,\"\")","v":""},null,null,null,{"$f":"IF(FP$2=1,Klimadaten!FP23,\"\")","v":""},null,null,null,{"$f":"IF(FT$2=1,Klimadaten!FT23,\"\")","v":""},null,null,null,{"$f":"IF(FX$2=1,Klimadaten!FX23,\"\")","v":""},null,null,null,{"$f":"IF(GB$2=1,Klimadaten!GB23,\"\")","v":""},null,null,null,{"$f":"IF(GF$2=1,Klimadaten!GF23,\"\")","v":""},null,null,null,{"$f":"IF(GJ$2=1,Klimadaten!GJ23,\"\")","v":""},null,null,null,{"$f":"IF(GN$2=1,Klimadaten!GN23,\"\")","v":""},null,null,null,{"$f":"IF(GR$2=1,Klimadaten!GR23,\"\")","v":""},null,null,null,{"$f":"IF(GV$2=1,Klimadaten!GV23,\"\")","v":""},null,null,null,{"$f":"IF(GZ$2=1,Klimadaten!GZ23,\"\")","v":""},null,null,null,{"$f":"IF(HD$2=1,Klimadaten!HD23,\"\")","v":""},null,null,null,{"$f":"IF(HH$2=1,Klimadaten!HH23,\"\")","v":""},null,null,null,{"$f":"IF(HL$2=1,Klimadaten!HL23,\"\")","v":8},null,null,null,null,null,null,null,null,null,null,null,null,null,null,null,null,null,null,null,{"$f":"IF(IF$2=1,Klimadaten!IF23,\"\")","v":""},null,null,null,{"$f":"IF(IJ$2=1,Klimadaten!IJ23,\"\")","v":""},null,null,null,{"$f":"IF(IN$2=1,Klimadaten!IN23,\"\")","v":""},null,null,null,{"$f":"IF(IR$2=1,Klimadaten!IR23,\"\")","v":""},null,null,null,{"$f":"IF(IV$2=1,Klimadaten!IV23,\"\")","v":""}]
[-6,null,null,{"$f":"IF(D$2=1,Klimadaten!D24,\"\")","v":""},null,null,null,{"$f":"IF(H$2=1,Klimadaten!H24,\"\")","v":2},null,null,null,{"$f":"IF(L$2=1,Klimadaten!L24,\"\")","v":0},null,null,null,{"$f":"IF(P$2=1,Klimadaten!P24,\"\")","v":""},null,null,null,{"$f":"IF(T$2=1,Klimadaten!T24,\"\")","v":""},null,null,null,{"$f":"IF(X$2=1,Klimadaten!X24,\"\")","v":""},null,null,null,{"$f":"IF(AB$2=1,Klimadaten!AB24,\"\")","v":""},null,null,null,{"$f":"IF(AF$2=1,Klimadaten!AF24,\"\")","v":""},null,null,null,{"$f":"IF(AJ$2=1,Klimadaten!AJ24,\"\")","v":""},null,null,null,{"$f":"IF(AN$2=1,Klimadaten!AN24,\"\")","v":""},null,null,null,{"$f":"IF(AR$2=1,Klimadaten!AR24,\"\")","v":""},null,null,null,{"$f":"IF(AV$2=1,Klimadaten!AV24,\"\")","v":""},null,null,null,{"$f":"IF(AZ$2=1,Klimadaten!AZ24,\"\")","v":""},null,null,null,{"$f":"IF(BD$2=1,Klimadaten!BD24,\"\")","v":""},null,null,null,{"$f":"IF(BH$2=1,Klimadaten!BH24,\"\")","v":""},null,null,null,{"$f":"IF(BL$2=1,Klimadaten!BL24,\"\")","v":""},null,null,null,{"$f":"IF(BP$2=1,Klimadaten!BP24,\"\")","v":""},null,null,null,{"$f":"IF(BT$2=1,Klimadaten!BT24,\"\")","v":""},null,null,null,{"$f":"IF(BX$2=1,Klimadaten!BX24,\"\")","v":""},null,null,null,{"$f":"IF(CB$2=1,Klimadaten!CB24,\"\")","v":""},null,null,null,{"$f":"IF(CF$2=1,Klimadaten!CF24,\"\")","v":""},null,null,null,{"$f":"IF(CJ$2=1,Klimadaten!CJ24,\"\")","v":""},null,null,null,{"$f":"IF(CN$2=1,Klimadaten!CN24,\"\")","v":""},null,null,null,{"$f":"IF(CR$2=1,Klimadaten!CR24,\"\")","v":6},null,null,null,{"$f":"IF(CV$2=1,Klimadaten!CV24,\"\")","v":""},null,null,null,{"$f":"IF(CZ$2=1,Klimadaten!CZ24,\"\")","v":""},null,null,null,{"$f":"IF(DD$2=1,Klimadaten!DD24,\"\")","v":""},null,null,null,{"$f":"IF(DH$2=1,Klimadaten!DH24,\"\")","v":""},null,null,null,{"$f":"IF(DL$2=1,Klimadaten!DL24,\"\")","v":""},null,null,null,{"$f":"IF(DP$2=1,Klimadaten!DP24,\"\")","v":""},null,null,null,{"$f":"IF(DT$2=1,Klimadaten!DT24,\"\")","v":""},null,null,null,{"$f":"IF(DX$2=1,Klimadaten!DX24,\"\")","v":""},null,null,null,{"$f":"IF(EB$2=1,Klimadaten!EB24,\"\")","v":""},null,null,null,{"$f":"IF(EF$2=1,Klimadaten!EF24,\"\")","v":""},null,null,null,{"$f":"IF(EJ$2=1,Klimadaten!EJ24,\"\")","v":""},null,null,null,{"$f":"IF(EN$2=1,Klimadaten!EN24,\"\")","v":""},null,null,null,{"$f":"IF(ER$2=1,Klimadaten!ER24,\"\")","v":""},null,null,null,{"$f":"IF(EV$2=1,Klimadaten!EV24,\"\")","v":""},null,null,null,{"$f":"IF(EZ$2=1,Klimadaten!EZ24,\"\")","v":""},null,null,null,{"$f":"IF(FD$2=1,Klimadaten!FD24,\"\")","v":""},null,null,null,{"$f":"IF(FH$2=1,Klimadaten!FH24,\"\")","v":""},null,null,null,{"$f":"IF(FL$2=1,Klimadaten!FL24,\"\")","v":""},null,null,null,{"$f":"IF(FP$2=1,Klimadaten!FP24,\"\")","v":""},null,null,null,{"$f":"IF(FT$2=1,Klimadaten!FT24,\"\")","v":""},null,null,null,{"$f":"IF(FX$2=1,Klimadaten!FX24,\"\")","v":""},null,null,null,{"$f":"IF(GB$2=1,Klimadaten!GB24,\"\")","v":""},null,null,null,{"$f":"IF(GF$2=1,Klimadaten!GF24,\"\")","v":""},null,null,null,{"$f":"IF(GJ$2=1,Klimadaten!GJ24,\"\")","v":""},null,null,null,{"$f":"IF(GN$2=1,Klimadaten!GN24,\"\")","v":""},null,null,null,{"$f":"IF(GR$2=1,Klimadaten!GR24,\"\")","v":""},null,null,null,{"$f":"IF(GV$2=1,Klimadaten!GV24,\"\")","v":""},null,null,null,{"$f":"IF(GZ$2=1,Klimadaten!GZ24,\"\")","v":""},null,null,null,{"$f":"IF(HD$2=1,Klimadaten!HD24,\"\")","v":""},null,null,null,{"$f":"IF(HH$2=1,Klimadaten!HH24,\"\")","v":""},null,null,null,{"$f":"IF(HL$2=1,Klimadaten!HL24,\"\")","v":8},null,null,null,null,null,null,null,null,null,null,null,null,null,null,null,null,null,null,null,{"$f":"IF(IF$2=1,Klimadaten!IF24,\"\")","v":""},null,null,null,{"$f":"IF(IJ$2=1,Klimadaten!IJ24,\"\")","v":""},null,null,null,{"$f":"IF(IN$2=1,Klimadaten!IN24,\"\")","v":""},null,null,null,{"$f":"IF(IR$2=1,Klimadaten!IR24,\"\")","v":""},null,null,null,{"$f":"IF(IV$2=1,Klimadaten!IV24,\"\")","v":""}]
[-5,null,null,{"$f":"IF(D$2=1,Klimadaten!D25,\"\")","v":""},null,null,null,{"$f":"IF(H$2=1,Klimadaten!H25,\"\")","v":5},null,null,null,{"$f":"IF(L$2=1,Klimadaten!L25,\"\")","v":0},null,null,null,{"$f":"IF(P$2=1,Klimadaten!P25,\"\")","v":""},null,null,null,{"$f":"IF(T$2=1,Klimadaten!T25,\"\")","v":""},null,null,null,{"$f":"IF(X$2=1,Klimadaten!X25,\"\")","v":""},null,null,null,{"$f":"IF(AB$2=1,Klimadaten!AB25,\"\")","v":""},null,null,null,{"$f":"IF(AF$2=1,Klimadaten!AF25,\"\")","v":""},null,null,null,{"$f":"IF(AJ$2=1,Klimadaten!AJ25,\"\")","v":""},null,null,null,{"$f":"IF(AN$2=1,Klimadaten!AN25,\"\")","v":""},null,null,null,{"$f":"IF(AR$2=1,Klimadaten!AR25,\"\")","v":""},null,null,null,{"$f":"IF(AV$2=1,Klimadaten!AV25,\"\")","v":""},null,null,null,{"$f":"IF(AZ$2=1,Klimadaten!AZ25,\"\")","v":""},null,null,null,{"$f":"IF(BD$2=1,Klimadaten!BD25,\"\")","v":""},null,null,null,{"$f":"IF(BH$2=1,Klimadaten!BH25,\"\")","v":""},null,null,null,{"$f":"IF(BL$2=1,Klimadaten!BL25,\"\")","v":""},null,null,null,{"$f":"IF(BP$2=1,Klimadaten!BP25,\"\")","v":""},null,null,null,{"$f":"IF(BT$2=1,Klimadaten!BT25,\"\")","v":""},null,null,null,{"$f":"IF(BX$2=1,Klimadaten!BX25,\"\")","v":""},null,null,null,{"$f":"IF(CB$2=1,Klimadaten!CB25,\"\")","v":""},null,null,null,{"$f":"IF(CF$2=1,Klimadaten!CF25,\"\")","v":""},null,null,null,{"$f":"IF(CJ$2=1,Klimadaten!CJ25,\"\")","v":""},null,null,null,{"$f":"IF(CN$2=1,Klimadaten!CN25,\"\")","v":""},null,null,null,{"$f":"IF(CR$2=1,Klimadaten!CR25,\"\")","v":5},null,null,null,{"$f":"IF(CV$2=1,Klimadaten!CV25,\"\")","v":""},null,null,null,{"$f":"IF(CZ$2=1,Klimadaten!CZ25,\"\")","v":""},null,null,null,{"$f":"IF(DD$2=1,Klimadaten!DD25,\"\")","v":""},null,null,null,{"$f":"IF(DH$2=1,Klimadaten!DH25,\"\")","v":""},null,null,null,{"$f":"IF(DL$2=1,Klimadaten!DL25,\"\")","v":""},null,null,null,{"$f":"IF(DP$2=1,Klimadaten!DP25,\"\")","v":""},null,null,null,{"$f":"IF(DT$2=1,Klimadaten!DT25,\"\")","v":""},null,null,null,{"$f":"IF(DX$2=1,Klimadaten!DX25,\"\")","v":""},null,null,null,{"$f":"IF(EB$2=1,Klimadaten!EB25,\"\")","v":""},null,null,null,{"$f":"IF(EF$2=1,Klimadaten!EF25,\"\")","v":""},null,null,null,{"$f":"IF(EJ$2=1,Klimadaten!EJ25,\"\")","v":""},null,null,null,{"$f":"IF(EN$2=1,Klimadaten!EN25,\"\")","v":""},null,null,null,{"$f":"IF(ER$2=1,Klimadaten!ER25,\"\")","v":""},null,null,null,{"$f":"IF(EV$2=1,Klimadaten!EV25,\"\")","v":""},null,null,null,{"$f":"IF(EZ$2=1,Klimadaten!EZ25,\"\")","v":""},null,null,null,{"$f":"IF(FD$2=1,Klimadaten!FD25,\"\")","v":""},null,null,null,{"$f":"IF(FH$2=1,Klimadaten!FH25,\"\")","v":""},null,null,null,{"$f":"IF(FL$2=1,Klimadaten!FL25,\"\")","v":""},null,null,null,{"$f":"IF(FP$2=1,Klimadaten!FP25,\"\")","v":""},null,null,null,{"$f":"IF(FT$2=1,Klimadaten!FT25,\"\")","v":""},null,null,null,{"$f":"IF(FX$2=1,Klimadaten!FX25,\"\")","v":""},null,null,null,{"$f":"IF(GB$2=1,Klimadaten!GB25,\"\")","v":""},null,null,null,{"$f":"IF(GF$2=1,Klimadaten!GF25,\"\")","v":""},null,null,null,{"$f":"IF(GJ$2=1,Klimadaten!GJ25,\"\")","v":""},null,null,null,{"$f":"IF(GN$2=1,Klimadaten!GN25,\"\")","v":""},null,null,null,{"$f":"IF(GR$2=1,Klimadaten!GR25,\"\")","v":""},null,null,null,{"$f":"IF(GV$2=1,Klimadaten!GV25,\"\")","v":""},null,null,null,{"$f":"IF(GZ$2=1,Klimadaten!GZ25,\"\")","v":""},null,null,null,{"$f":"IF(HD$2=1,Klimadaten!HD25,\"\")","v":""},null,null,null,{"$f":"IF(HH$2=1,Klimadaten!HH25,\"\")","v":""},null,null,null,{"$f":"IF(HL$2=1,Klimadaten!HL25,\"\")","v":10},null,null,null,null,null,null,null,null,null,null,null,null,null,null,null,null,null,null,null,{"$f":"IF(IF$2=1,Klimadaten!IF25,\"\")","v":""},null,null,null,{"$f":"IF(IJ$2=1,Klimadaten!IJ25,\"\")","v":""},null,null,null,{"$f":"IF(IN$2=1,Klimadaten!IN25,\"\")","v":""},null,null,null,{"$f":"IF(IR$2=1,Klimadaten!IR25,\"\")","v":""},null,null,null,{"$f":"IF(IV$2=1,Klimadaten!IV25,\"\")","v":""}]
[-4,null,null,{"$f":"IF(D$2=1,Klimadaten!D26,\"\")","v":""},null,null,null,{"$f":"IF(H$2=1,Klimadaten!H26,\"\")","v":5},null,null,null,{"$f":"IF(L$2=1,Klimadaten!L26,\"\")","v":0},null,null,null,{"$f":"IF(P$2=1,Klimadaten!P26,\"\")","v":""},null,null,null,{"$f":"IF(T$2=1,Klimadaten!T26,\"\")","v":""},null,null,null,{"$f":"IF(X$2=1,Klimadaten!X26,\"\")","v":""},null,null,null,{"$f":"IF(AB$2=1,Klimadaten!AB26,\"\")","v":""},null,null,null,{"$f":"IF(AF$2=1,Klimadaten!AF26,\"\")","v":""},null,null,null,{"$f":"IF(AJ$2=1,Klimadaten!AJ26,\"\")","v":""},null,null,null,{"$f":"IF(AN$2=1,Klimadaten!AN26,\"\")","v":""},null,null,null,{"$f":"IF(AR$2=1,Klimadaten!AR26,\"\")","v":""},null,null,null,{"$f":"IF(AV$2=1,Klimadaten!AV26,\"\")","v":""},null,null,null,{"$f":"IF(AZ$2=1,Klimadaten!AZ26,\"\")","v":""},null,null,null,{"$f":"IF(BD$2=1,Klimadaten!BD26,\"\")","v":""},null,null,null,{"$f":"IF(BH$2=1,Klimadaten!BH26,\"\")","v":""},null,null,null,{"$f":"IF(BL$2=1,Klimadaten!BL26,\"\")","v":""},null,null,null,{"$f":"IF(BP$2=1,Klimadaten!BP26,\"\")","v":""},null,null,null,{"$f":"IF(BT$2=1,Klimadaten!BT26,\"\")","v":""},null,null,null,{"$f":"IF(BX$2=1,Klimadaten!BX26,\"\")","v":""},null,null,null,{"$f":"IF(CB$2=1,Klimadaten!CB26,\"\")","v":""},null,null,null,{"$f":"IF(CF$2=1,Klimadaten!CF26,\"\")","v":""},null,null,null,{"$f":"IF(CJ$2=1,Klimadaten!CJ26,\"\")","v":""},null,null,null,{"$f":"IF(CN$2=1,Klimadaten!CN26,\"\")","v":""},null,null,null,{"$f":"IF(CR$2=1,Klimadaten!CR26,\"\")","v":7},null,null,null,{"$f":"IF(CV$2=1,Klimadaten!CV26,\"\")","v":""},null,null,null,{"$f":"IF(CZ$2=1,Klimadaten!CZ26,\"\")","v":""},null,null,null,{"$f":"IF(DD$2=1,Klimadaten!DD26,\"\")","v":""},null,null,null,{"$f":"IF(DH$2=1,Klimadaten!DH26,\"\")","v":""},null,null,null,{"$f":"IF(DL$2=1,Klimadaten!DL26,\"\")","v":""},null,null,null,{"$f":"IF(DP$2=1,Klimadaten!DP26,\"\")","v":""},null,null,null,{"$f":"IF(DT$2=1,Klimadaten!DT26,\"\")","v":""},null,null,null,{"$f":"IF(DX$2=1,Klimadaten!DX26,\"\")","v":""},null,null,null,{"$f":"IF(EB$2=1,Klimadaten!EB26,\"\")","v":""},null,null,null,{"$f":"IF(EF$2=1,Klimadaten!EF26,\"\")","v":""},null,null,null,{"$f":"IF(EJ$2=1,Klimadaten!EJ26,\"\")","v":""},null,null,null,{"$f":"IF(EN$2=1,Klimadaten!EN26,\"\")","v":""},null,null,null,{"$f":"IF(ER$2=1,Klimadaten!ER26,\"\")","v":""},null,null,null,{"$f":"IF(EV$2=1,Klimadaten!EV26,\"\")","v":""},null,null,null,{"$f":"IF(EZ$2=1,Klimadaten!EZ26,\"\")","v":""},null,null,null,{"$f":"IF(FD$2=1,Klimadaten!FD26,\"\")","v":""},null,null,null,{"$f":"IF(FH$2=1,Klimadaten!FH26,\"\")","v":""},null,null,null,{"$f":"IF(FL$2=1,Klimadaten!FL26,\"\")","v":""},null,null,null,{"$f":"IF(FP$2=1,Klimadaten!FP26,\"\")","v":""},null,null,null,{"$f":"IF(FT$2=1,Klimadaten!FT26,\"\")","v":""},null,null,null,{"$f":"IF(FX$2=1,Klimadaten!FX26,\"\")","v":""},null,null,null,{"$f":"IF(GB$2=1,Klimadaten!GB26,\"\")","v":""},null,null,null,{"$f":"IF(GF$2=1,Klimadaten!GF26,\"\")","v":""},null,null,null,{"$f":"IF(GJ$2=1,Klimadaten!GJ26,\"\")","v":""},null,null,null,{"$f":"IF(GN$2=1,Klimadaten!GN26,\"\")","v":""},null,null,null,{"$f":"IF(GR$2=1,Klimadaten!GR26,\"\")","v":""},null,null,null,{"$f":"IF(GV$2=1,Klimadaten!GV26,\"\")","v":""},null,null,null,{"$f":"IF(GZ$2=1,Klimadaten!GZ26,\"\")","v":""},null,null,null,{"$f":"IF(HD$2=1,Klimadaten!HD26,\"\")","v":""},null,null,null,{"$f":"IF(HH$2=1,Klimadaten!HH26,\"\")","v":""},null,null,null,{"$f":"IF(HL$2=1,Klimadaten!HL26,\"\")","v":11},null,null,null,null,null,null,null,null,null,null,null,null,null,null,null,null,null,null,null,{"$f":"IF(IF$2=1,Klimadaten!IF26,\"\")","v":""},null,null,null,{"$f":"IF(IJ$2=1,Klimadaten!IJ26,\"\")","v":""},null,null,null,{"$f":"IF(IN$2=1,Klimadaten!IN26,\"\")","v":""},null,null,null,{"$f":"IF(IR$2=1,Klimadaten!IR26,\"\")","v":""},null,null,null,{"$f":"IF(IV$2=1,Klimadaten!IV26,\"\")","v":""}]
[-3,null,null,{"$f":"IF(D$2=1,Klimadaten!D27,\"\")","v":""},null,null,null,{"$f":"IF(H$2=1,Klimadaten!H27,\"\")","v":7},null,null,null,{"$f":"IF(L$2=1,Klimadaten!L27,\"\")","v":0},null,null,null,{"$f":"IF(P$2=1,Klimadaten!P27,\"\")","v":""},null,null,null,{"$f":"IF(T$2=1,Klimadaten!T27,\"\")","v":""},null,null,null,{"$f":"IF(X$2=1,Klimadaten!X27,\"\")","v":""},null,null,null,{"$f":"IF(AB$2=1,Klimadaten!AB27,\"\")","v":""},null,null,null,{"$f":"IF(AF$2=1,Klimadaten!AF27,\"\")","v":""},null,null,null,{"$f":"IF(AJ$2=1,Klimadaten!AJ27,\"\")","v":""},null,null,null,{"$f":"IF(AN$2=1,Klimadaten!AN27,\"\")","v":""},null,null,null,{"$f":"IF(AR$2=1,Klimadaten!AR27,\"\")","v":""},null,null,null,{"$f":"IF(AV$2=1,Klimadaten!AV27,\"\")","v":""},null,null,null,{"$f":"IF(AZ$2=1,Klimadaten!AZ27,\"\")","v":""},null,null,null,{"$f":"IF(BD$2=1,Klimadaten!BD27,\"\")","v":""},null,null,null,{"$f":"IF(BH$2=1,Klimadaten!BH27,\"\")","v":""},null,null,null,{"$f":"IF(BL$2=1,Klimadaten!BL27,\"\")","v":""},null,null,null,{"$f":"IF(BP$2=1,Klimadaten!BP27,\"\")","v":""},null,null,null,{"$f":"IF(BT$2=1,Klimadaten!BT27,\"\")","v":""},null,null,null,{"$f":"IF(BX$2=1,Klimadaten!BX27,\"\")","v":""},null,null,null,{"$f":"IF(CB$2=1,Klimadaten!CB27,\"\")","v":""},null,null,null,{"$f":"IF(CF$2=1,Klimadaten!CF27,\"\")","v":""},null,null,null,{"$f":"IF(CJ$2=1,Klimadaten!CJ27,\"\")","v":""},null,null,null,{"$f":"IF(CN$2=1,Klimadaten!CN27,\"\")","v":""},null,null,null,{"$f":"IF(CR$2=1,Klimadaten!CR27,\"\")","v":9},null,null,null,{"$f":"IF(CV$2=1,Klimadaten!CV27,\"\")","v":""},null,null,null,{"$f":"IF(CZ$2=1,Klimadaten!CZ27,\"\")","v":""},null,null,null,{"$f":"IF(DD$2=1,Klimadaten!DD27,\"\")","v":""},null,null,null,{"$f":"IF(DH$2=1,Klimadaten!DH27,\"\")","v":""},null,null,null,{"$f":"IF(DL$2=1,Klimadaten!DL27,\"\")","v":""},null,null,null,{"$f":"IF(DP$2=1,Klimadaten!DP27,\"\")","v":""},null,null,null,{"$f":"IF(DT$2=1,Klimadaten!DT27,\"\")","v":""},null,null,null,{"$f":"IF(DX$2=1,Klimadaten!DX27,\"\")","v":""},null,null,null,{"$f":"IF(EB$2=1,Klimadaten!EB27,\"\")","v":""},null,null,null,{"$f":"IF(EF$2=1,Klimadaten!EF27,\"\")","v":""},null,null,null,{"$f":"IF(EJ$2=1,Klimadaten!EJ27,\"\")","v":""},null,null,null,{"$f":"IF(EN$2=1,Klimadaten!EN27,\"\")","v":""},null,null,null,{"$f":"IF(ER$2=1,Klimadaten!ER27,\"\")","v":""},null,null,null,{"$f":"IF(EV$2=1,Klimadaten!EV27,\"\")","v":""},null,null,null,{"$f":"IF(EZ$2=1,Klimadaten!EZ27,\"\")","v":""},null,null,null,{"$f":"IF(FD$2=1,Klimadaten!FD27,\"\")","v":""},null,null,null,{"$f":"IF(FH$2=1,Klimadaten!FH27,\"\")","v":""},null,null,null,{"$f":"IF(FL$2=1,Klimadaten!FL27,\"\")","v":""},null,null,null,{"$f":"IF(FP$2=1,Klimadaten!FP27,\"\")","v":""},null,null,null,{"$f":"IF(FT$2=1,Klimadaten!FT27,\"\")","v":""},null,null,null,{"$f":"IF(FX$2=1,Klimadaten!FX27,\"\")","v":""},null,null,null,{"$f":"IF(GB$2=1,Klimadaten!GB27,\"\")","v":""},null,null,null,{"$f":"IF(GF$2=1,Klimadaten!GF27,\"\")","v":""},null,null,null,{"$f":"IF(GJ$2=1,Klimadaten!GJ27,\"\")","v":""},null,null,null,{"$f":"IF(GN$2=1,Klimadaten!GN27,\"\")","v":""},null,null,null,{"$f":"IF(GR$2=1,Klimadaten!GR27,\"\")","v":""},null,null,null,{"$f":"IF(GV$2=1,Klimadaten!GV27,\"\")","v":""},null,null,null,{"$f":"IF(GZ$2=1,Klimadaten!GZ27,\"\")","v":""},null,null,null,{"$f":"IF(HD$2=1,Klimadaten!HD27,\"\")","v":""},null,null,null,{"$f":"IF(HH$2=1,Klimadaten!HH27,\"\")","v":""},null,null,null,{"$f":"IF(HL$2=1,Klimadaten!HL27,\"\")","v":12},null,null,null,null,null,null,null,null,null,null,null,null,null,null,null,null,null,null,null,{"$f":"IF(IF$2=1,Klimadaten!IF27,\"\")","v":""},null,null,null,{"$f":"IF(IJ$2=1,Klimadaten!IJ27,\"\")","v":""},null,null,null,{"$f":"IF(IN$2=1,Klimadaten!IN27,\"\")","v":""},null,null,null,{"$f":"IF(IR$2=1,Klimadaten!IR27,\"\")","v":""},null,null,null,{"$f":"IF(IV$2=1,Klimadaten!IV27,\"\")","v":""}]
[-2,null,null,{"$f":"IF(D$2=1,Klimadaten!D28,\"\")","v":""},null,null,null,{"$f":"IF(H$2=1,Klimadaten!H28,\"\")","v":7},null,null,null,{"$f":"IF(L$2=1,Klimadaten!L28,\"\")","v":1},null,null,null,{"$f":"IF(P$2=1,Klimadaten!P28,\"\")","v":""},null,null,null,{"$f":"IF(T$2=1,Klimadaten!T28,\"\")","v":""},null,null,null,{"$f":"IF(X$2=1,Klimadaten!X28,\"\")","v":""},null,null,null,{"$f":"IF(AB$2=1,Klimadaten!AB28,\"\")","v":""},null,null,null,{"$f":"IF(AF$2=1,Klimadaten!AF28,\"\")","v":""},null,null,null,{"$f":"IF(AJ$2=1,Klimadaten!AJ28,\"\")","v":""},null,null,null,{"$f":"IF(AN$2=1,Klimadaten!AN28,\"\")","v":""},null,null,null,{"$f":"IF(AR$2=1,Klimadaten!AR28,\"\")","v":""},null,null,null,{"$f":"IF(AV$2=1,Klimadaten!AV28,\"\")","v":""},null,null,null,{"$f":"IF(AZ$2=1,Klimadaten!AZ28,\"\")","v":""},null,null,null,{"$f":"IF(BD$2=1,Klimadaten!BD28,\"\")","v":""},null,null,null,{"$f":"IF(BH$2=1,Klimadaten!BH28,\"\")","v":""},null,null,null,{"$f":"IF(BL$2=1,Klimadaten!BL28,\"\")","v":""},null,null,null,{"$f":"IF(BP$2=1,Klimadaten!BP28,\"\")","v":""},null,null,null,{"$f":"IF(BT$2=1,Klimadaten!BT28,\"\")","v":""},null,null,null,{"$f":"IF(BX$2=1,Klimadaten!BX28,\"\")","v":""},null,null,null,{"$f":"IF(CB$2=1,Klimadaten!CB28,\"\")","v":""},null,null,null,{"$f":"IF(CF$2=1,Klimadaten!CF28,\"\")","v":""},null,null,null,{"$f":"IF(CJ$2=1,Klimadaten!CJ28,\"\")","v":""},null,null,null,{"$f":"IF(CN$2=1,Klimadaten!CN28,\"\")","v":""},null,null,null,{"$f":"IF(CR$2=1,Klimadaten!CR28,\"\")","v":9},null,null,null,{"$f":"IF(CV$2=1,Klimadaten!CV28,\"\")","v":""},null,null,null,{"$f":"IF(CZ$2=1,Klimadaten!CZ28,\"\")","v":""},null,null,null,{"$f":"IF(DD$2=1,Klimadaten!DD28,\"\")","v":""},null,null,null,{"$f":"IF(DH$2=1,Klimadaten!DH28,\"\")","v":""},null,null,null,{"$f":"IF(DL$2=1,Klimadaten!DL28,\"\")","v":""},null,null,null,{"$f":"IF(DP$2=1,Klimadaten!DP28,\"\")","v":""},null,null,null,{"$f":"IF(DT$2=1,Klimadaten!DT28,\"\")","v":""},null,null,null,{"$f":"IF(DX$2=1,Klimadaten!DX28,\"\")","v":""},null,null,null,{"$f":"IF(EB$2=1,Klimadaten!EB28,\"\")","v":""},null,null,null,{"$f":"IF(EF$2=1,Klimadaten!EF28,\"\")","v":""},null,null,null,{"$f":"IF(EJ$2=1,Klimadaten!EJ28,\"\")","v":""},null,null,null,{"$f":"IF(EN$2=1,Klimadaten!EN28,\"\")","v":""},null,null,null,{"$f":"IF(ER$2=1,Klimadaten!ER28,\"\")","v":""},null,null,null,{"$f":"IF(EV$2=1,Klimadaten!EV28,\"\")","v":""},null,null,null,{"$f":"IF(EZ$2=1,Klimadaten!EZ28,\"\")","v":""},null,null,null,{"$f":"IF(FD$2=1,Klimadaten!FD28,\"\")","v":""},null,null,null,{"$f":"IF(FH$2=1,Klimadaten!FH28,\"\")","v":""},null,null,null,{"$f":"IF(FL$2=1,Klimadaten!FL28,\"\")","v":""},null,null,null,{"$f":"IF(FP$2=1,Klimadaten!FP28,\"\")","v":""},null,null,null,{"$f":"IF(FT$2=1,Klimadaten!FT28,\"\")","v":""},null,null,null,{"$f":"IF(FX$2=1,Klimadaten!FX28,\"\")","v":""},null,null,null,{"$f":"IF(GB$2=1,Klimadaten!GB28,\"\")","v":""},null,null,null,{"$f":"IF(GF$2=1,Klimadaten!GF28,\"\")","v":""},null,null,null,{"$f":"IF(GJ$2=1,Klimadaten!GJ28,\"\")","v":""},null,null,null,{"$f":"IF(GN$2=1,Klimadaten!GN28,\"\")","v":""},null,null,null,{"$f":"IF(GR$2=1,Klimadaten!GR28,\"\")","v":""},null,null,null,{"$f":"IF(GV$2=1,Klimadaten!GV28,\"\")","v":""},null,null,null,{"$f":"IF(GZ$2=1,Klimadaten!GZ28,\"\")","v":""},null,null,null,{"$f":"IF(HD$2=1,Klimadaten!HD28,\"\")","v":""},null,null,null,{"$f":"IF(HH$2=1,Klimadaten!HH28,\"\")","v":""},null,null,null,{"$f":"IF(HL$2=1,Klimadaten!HL28,\"\")","v":12},null,null,null,null,null,null,null,null,null,null,null,null,null,null,null,null,null,null,null,{"$f":"IF(IF$2=1,Klimadaten!IF28,\"\")","v":""},null,null,null,{"$f":"IF(IJ$2=1,Klimadaten!IJ28,\"\")","v":""},null,null,null,{"$f":"IF(IN$2=1,Klimadaten!IN28,\"\")","v":""},null,null,null,{"$f":"IF(IR$2=1,Klimadaten!IR28,\"\")","v":""},null,null,null,{"$f":"IF(IV$2=1,Klimadaten!IV28,\"\")","v":""}]
[-1,null,null,{"$f":"IF(D$2=1,Klimadaten!D29,\"\")","v":""},null,null,null,{"$f":"IF(H$2=1,Klimadaten!H29,\"\")","v":8},null,null,null,{"$f":"IF(L$2=1,Klimadaten!L29,\"\")","v":2},null,null,null,{"$f":"IF(P$2=1,Klimadaten!P29,\"\")","v":""},null,null,null,{"$f":"IF(T$2=1,Klimadaten!T29,\"\")","v":""},null,null,null,{"$f":"IF(X$2=1,Klimadaten!X29,\"\")","v":""},null,null,null,{"$f":"IF(AB$2=1,Klimadaten!AB29,\"\")","v":""},null,null,null,{"$f":"IF(AF$2=1,Klimadaten!AF29,\"\")","v":""},null,null,null,{"$f":"IF(AJ$2=1,Klimadaten!AJ29,\"\")","v":""},null,null,null,{"$f":"IF(AN$2=1,Klimadaten!AN29,\"\")","v":""},null,null,null,{"$f":"IF(AR$2=1,Klimadaten!AR29,\"\")","v":""},null,null,null,{"$f":"IF(AV$2=1,Klimadaten!AV29,\"\")","v":""},null,null,null,{"$f":"IF(AZ$2=1,Klimadaten!AZ29,\"\")","v":""},null,null,null,{"$f":"IF(BD$2=1,Klimadaten!BD29,\"\")","v":""},null,null,null,{"$f":"IF(BH$2=1,Klimadaten!BH29,\"\")","v":""},null,null,null,{"$f":"IF(BL$2=1,Klimadaten!BL29,\"\")","v":""},null,null,null,{"$f":"IF(BP$2=1,Klimadaten!BP29,\"\")","v":""},null,null,null,{"$f":"IF(BT$2=1,Klimadaten!BT29,\"\")","v":""},null,null,null,{"$f":"IF(BX$2=1,Klimadaten!BX29,\"\")","v":""},null,null,null,{"$f":"IF(CB$2=1,Klimadaten!CB29,\"\")","v":""},null,null,null,{"$f":"IF(CF$2=1,Klimadaten!CF29,\"\")","v":""},null,null,null,{"$f":"IF(CJ$2=1,Klimadaten!CJ29,\"\")","v":""},null,null,null,{"$f":"IF(CN$2=1,Klimadaten!CN29,\"\")","v":""},null,null,null,{"$f":"IF(CR$2=1,Klimadaten!CR29,\"\")","v":13},null,null,null,{"$f":"IF(CV$2=1,Klimadaten!CV29,\"\")","v":""},null,null,null,{"$f":"IF(CZ$2=1,Klimadaten!CZ29,\"\")","v":""},null,null,null,{"$f":"IF(DD$2=1,Klimadaten!DD29,\"\")","v":""},null,null,null,{"$f":"IF(DH$2=1,Klimadaten!DH29,\"\")","v":""},null,null,null,{"$f":"IF(DL$2=1,Klimadaten!DL29,\"\")","v":""},null,null,null,{"$f":"IF(DP$2=1,Klimadaten!DP29,\"\")","v":""},null,null,null,{"$f":"IF(DT$2=1,Klimadaten!DT29,\"\")","v":""},null,null,null,{"$f":"IF(DX$2=1,Klimadaten!DX29,\"\")","v":""},null,null,null,{"$f":"IF(EB$2=1,Klimadaten!EB29,\"\")","v":""},null,null,null,{"$f":"IF(EF$2=1,Klimadaten!EF29,\"\")","v":""},null,null,null,{"$f":"IF(EJ$2=1,Klimadaten!EJ29,\"\")","v":""},null,null,null,{"$f":"IF(EN$2=1,Klimadaten!EN29,\"\")","v":""},null,null,null,{"$f":"IF(ER$2=1,Klimadaten!ER29,\"\")","v":""},null,null,null,{"$f":"IF(EV$2=1,Klimadaten!EV29,\"\")","v":""},null,null,null,{"$f":"IF(EZ$2=1,Klimadaten!EZ29,\"\")","v":""},null,null,null,{"$f":"IF(FD$2=1,Klimadaten!FD29,\"\")","v":""},null,null,null,{"$f":"IF(FH$2=1,Klimadaten!FH29,\"\")","v":""},null,null,null,{"$f":"IF(FL$2=1,Klimadaten!FL29,\"\")","v":""},null,null,null,{"$f":"IF(FP$2=1,Klimadaten!FP29,\"\")","v":""},null,null,null,{"$f":"IF(FT$2=1,Klimadaten!FT29,\"\")","v":""},null,null,null,{"$f":"IF(FX$2=1,Klimadaten!FX29,\"\")","v":""},null,null,null,{"$f":"IF(GB$2=1,Klimadaten!GB29,\"\")","v":""},null,null,null,{"$f":"IF(GF$2=1,Klimadaten!GF29,\"\")","v":""},null,null,null,{"$f":"IF(GJ$2=1,Klimadaten!GJ29,\"\")","v":""},null,null,null,{"$f":"IF(GN$2=1,Klimadaten!GN29,\"\")","v":""},null,null,null,{"$f":"IF(GR$2=1,Klimadaten!GR29,\"\")","v":""},null,null,null,{"$f":"IF(GV$2=1,Klimadaten!GV29,\"\")","v":""},null,null,null,{"$f":"IF(GZ$2=1,Klimadaten!GZ29,\"\")","v":""},null,null,null,{"$f":"IF(HD$2=1,Klimadaten!HD29,\"\")","v":""},null,null,null,{"$f":"IF(HH$2=1,Klimadaten!HH29,\"\")","v":""},null,null,null,{"$f":"IF(HL$2=1,Klimadaten!HL29,\"\")","v":13},null,null,null,null,null,null,null,null,null,null,null,null,null,null,null,null,null,null,null,{"$f":"IF(IF$2=1,Klimadaten!IF29,\"\")","v":""},null,null,null,{"$f":"IF(IJ$2=1,Klimadaten!IJ29,\"\")","v":""},null,null,null,{"$f":"IF(IN$2=1,Klimadaten!IN29,\"\")","v":""},null,null,null,{"$f":"IF(IR$2=1,Klimadaten!IR29,\"\")","v":""},null,null,null,{"$f":"IF(IV$2=1,Klimadaten!IV29,\"\")","v":""}]
[0,null,null,{"$f":"IF(D$2=1,Klimadaten!D30,\"\")","v":""},null,null,null,{"$f":"IF(H$2=1,Klimadaten!H30,\"\")","v":12},null,null,null,{"$f":"IF(L$2=1,Klimadaten!L30,\"\")","v":5},null,null,null,{"$f":"IF(P$2=1,Klimadaten!P30,\"\")","v":""},null,null,null,{"$f":"IF(T$2=1,Klimadaten!T30,\"\")","v":""},null,null,null,{"$f":"IF(X$2=1,Klimadaten!X30,\"\")","v":""},null,null,null,{"$f":"IF(AB$2=1,Klimadaten!AB30,\"\")","v":""},null,null,null,{"$f":"IF(AF$2=1,Klimadaten!AF30,\"\")","v":""},null,null,null,{"$f":"IF(AJ$2=1,Klimadaten!AJ30,\"\")","v":""},null,null,null,{"$f":"IF(AN$2=1,Klimadaten!AN30,\"\")","v":""},null,null,null,{"$f":"IF(AR$2=1,Klimadaten!AR30,\"\")","v":""},null,null,null,{"$f":"IF(AV$2=1,Klimadaten!AV30,\"\")","v":""},null,null,null,{"$f":"IF(AZ$2=1,Klimadaten!AZ30,\"\")","v":""},null,null,null,{"$f":"IF(BD$2=1,Klimadaten!BD30,\"\")","v":""},null,null,null,{"$f":"IF(BH$2=1,Klimadaten!BH30,\"\")","v":""},null,null,null,{"$f":"IF(BL$2=1,Klimadaten!BL30,\"\")","v":""},null,null,null,{"$f":"IF(BP$2=1,Klimadaten!BP30,\"\")","v":""},null,null,null,{"$f":"IF(BT$2=1,Klimadaten!BT30,\"\")","v":""},null,null,null,{"$f":"IF(BX$2=1,Klimadaten!BX30,\"\")","v":""},null,null,null,{"$f":"IF(CB$2=1,Klimadaten!CB30,\"\")","v":""},null,null,null,{"$f":"IF(CF$2=1,Klimadaten!CF30,\"\")","v":""},null,null,null,{"$f":"IF(CJ$2=1,Klimadaten!CJ30,\"\")","v":""},null,null,null,{"$f":"IF(CN$2=1,Klimadaten!CN30,\"\")","v":""},null,null,null,{"$f":"IF(CR$2=1,Klimadaten!CR30,\"\")","v":15},null,null,null,{"$f":"IF(CV$2=1,Klimadaten!CV30,\"\")","v":""},null,null,null,{"$f":"IF(CZ$2=1,Klimadaten!CZ30,\"\")","v":""},null,null,null,{"$f":"IF(DD$2=1,Klimadaten!DD30,\"\")","v":""},null,null,null,{"$f":"IF(DH$2=1,Klimadaten!DH30,\"\")","v":""},null,null,null,{"$f":"IF(DL$2=1,Klimadaten!DL30,\"\")","v":""},null,null,null,{"$f":"IF(DP$2=1,Klimadaten!DP30,\"\")","v":""},null,null,null,{"$f":"IF(DT$2=1,Klimadaten!DT30,\"\")","v":""},null,null,null,{"$f":"IF(DX$2=1,Klimadaten!DX30,\"\")","v":""},null,null,null,{"$f":"IF(EB$2=1,Klimadaten!EB30,\"\")","v":""},null,null,null,{"$f":"IF(EF$2=1,Klimadaten!EF30,\"\")","v":""},null,null,null,{"$f":"IF(EJ$2=1,Klimadaten!EJ30,\"\")","v":""},null,null,null,{"$f":"IF(EN$2=1,Klimadaten!EN30,\"\")","v":""},null,null,null,{"$f":"IF(ER$2=1,Klimadaten!ER30,\"\")","v":""},null,null,null,{"$f":"IF(EV$2=1,Klimadaten!EV30,\"\")","v":""},null,null,null,{"$f":"IF(EZ$2=1,Klimadaten!EZ30,\"\")","v":""},null,null,null,{"$f":"IF(FD$2=1,Klimadaten!FD30,\"\")","v":""},null,null,null,{"$f":"IF(FH$2=1,Klimadaten!FH30,\"\")","v":""},null,null,null,{"$f":"IF(FL$2=1,Klimadaten!FL30,\"\")","v":""},null,null,null,{"$f":"IF(FP$2=1,Klimadaten!FP30,\"\")","v":""},null,null,null,{"$f":"IF(FT$2=1,Klimadaten!FT30,\"\")","v":""},null,null,null,{"$f":"IF(FX$2=1,Klimadaten!FX30,\"\")","v":""},null,null,null,{"$f":"IF(GB$2=1,Klimadaten!GB30,\"\")","v":""},null,null,null,{"$f":"IF(GF$2=1,Klimadaten!GF30,\"\")","v":""},null,null,null,{"$f":"IF(GJ$2=1,Klimadaten!GJ30,\"\")","v":""},null,null,null,{"$f":"IF(GN$2=1,Klimadaten!GN30,\"\")","v":""},null,null,null,{"$f":"IF(GR$2=1,Klimadaten!GR30,\"\")","v":""},null,null,null,{"$f":"IF(GV$2=1,Klimadaten!GV30,\"\")","v":""},null,null,null,{"$f":"IF(GZ$2=1,Klimadaten!GZ30,\"\")","v":""},null,null,null,{"$f":"IF(HD$2=1,Klimadaten!HD30,\"\")","v":""},null,null,null,{"$f":"IF(HH$2=1,Klimadaten!HH30,\"\")","v":""},null,null,null,{"$f":"IF(HL$2=1,Klimadaten!HL30,\"\")","v":12},null,null,null,null,null,null,null,null,null,null,null,null,null,null,null,null,null,null,null,{"$f":"IF(IF$2=1,Klimadaten!IF30,\"\")","v":""},null,null,null,{"$f":"IF(IJ$2=1,Klimadaten!IJ30,\"\")","v":""},null,null,null,{"$f":"IF(IN$2=1,Klimadaten!IN30,\"\")","v":""},null,null,null,{"$f":"IF(IR$2=1,Klimadaten!IR30,\"\")","v":""},null,null,null,{"$f":"IF(IV$2=1,Klimadaten!IV30,\"\")","v":""}]
[1,null,null,{"$f":"IF(D$2=1,Klimadaten!D31,\"\")","v":""},null,null,null,{"$f":"IF(H$2=1,Klimadaten!H31,\"\")","v":13},null,null,null,{"$f":"IF(L$2=1,Klimadaten!L31,\"\")","v":8},null,null,null,{"$f":"IF(P$2=1,Klimadaten!P31,\"\")","v":""},null,null,null,{"$f":"IF(T$2=1,Klimadaten!T31,\"\")","v":""},null,null,null,{"$f":"IF(X$2=1,Klimadaten!X31,\"\")","v":""},null,null,null,{"$f":"IF(AB$2=1,Klimadaten!AB31,\"\")","v":""},null,null,null,{"$f":"IF(AF$2=1,Klimadaten!AF31,\"\")","v":""},null,null,null,{"$f":"IF(AJ$2=1,Klimadaten!AJ31,\"\")","v":""},null,null,null,{"$f":"IF(AN$2=1,Klimadaten!AN31,\"\")","v":""},null,null,null,{"$f":"IF(AR$2=1,Klimadaten!AR31,\"\")","v":""},null,null,null,{"$f":"IF(AV$2=1,Klimadaten!AV31,\"\")","v":""},null,null,null,{"$f":"IF(AZ$2=1,Klimadaten!AZ31,\"\")","v":""},null,null,null,{"$f":"IF(BD$2=1,Klimadaten!BD31,\"\")","v":""},null,null,null,{"$f":"IF(BH$2=1,Klimadaten!BH31,\"\")","v":""},null,null,null,{"$f":"IF(BL$2=1,Klimadaten!BL31,\"\")","v":""},null,null,null,{"$f":"IF(BP$2=1,Klimadaten!BP31,\"\")","v":""},null,null,null,{"$f":"IF(BT$2=1,Klimadaten!BT31,\"\")","v":""},null,null,null,{"$f":"IF(BX$2=1,Klimadaten!BX31,\"\")","v":""},null,null,null,{"$f":"IF(CB$2=1,Klimadaten!CB31,\"\")","v":""},null,null,null,{"$f":"IF(CF$2=1,Klimadaten!CF31,\"\")","v":""},null,null,null,{"$f":"IF(CJ$2=1,Klimadaten!CJ31,\"\")","v":""},null,null,null,{"$f":"IF(CN$2=1,Klimadaten!CN31,\"\")","v":""},null,null,null,{"$f":"IF(CR$2=1,Klimadaten!CR31,\"\")","v":16},null,null,null,{"$f":"IF(CV$2=1,Klimadaten!CV31,\"\")","v":""},null,null,null,{"$f":"IF(CZ$2=1,Klimadaten!CZ31,\"\")","v":""},null,null,null,{"$f":"IF(DD$2=1,Klimadaten!DD31,\"\")","v":""},null,null,null,{"$f":"IF(DH$2=1,Klimadaten!DH31,\"\")","v":""},null,null,null,{"$f":"IF(DL$2=1,Klimadaten!DL31,\"\")","v":""},null,null,null,{"$f":"IF(DP$2=1,Klimadaten!DP31,\"\")","v":""},null,null,null,{"$f":"IF(DT$2=1,Klimadaten!DT31,\"\")","v":""},null,null,null,{"$f":"IF(DX$2=1,Klimadaten!DX31,\"\")","v":""},null,null,null,{"$f":"IF(EB$2=1,Klimadaten!EB31,\"\")","v":""},null,null,null,{"$f":"IF(EF$2=1,Klimadaten!EF31,\"\")","v":""},null,null,null,{"$f":"IF(EJ$2=1,Klimadaten!EJ31,\"\")","v":""},null,null,null,{"$f":"IF(EN$2=1,Klimadaten!EN31,\"\")","v":""},null,null,null,{"$f":"IF(ER$2=1,Klimadaten!ER31,\"\")","v":""},null,null,null,{"$f":"IF(EV$2=1,Klimadaten!EV31,\"\")","v":""},null,null,null,{"$f":"IF(EZ$2=1,Klimadaten!EZ31,\"\")","v":""},null,null,null,{"$f":"IF(FD$2=1,Klimadaten!FD31,\"\")","v":""},null,null,null,{"$f":"IF(FH$2=1,Klimadaten!FH31,\"\")","v":""},null,null,null,{"$f":"IF(FL$2=1,Klimadaten!FL31,\"\")","v":""},null,null,null,{"$f":"IF(FP$2=1,Klimadaten!FP31,\"\")","v":""},null,null,null,{"$f":"IF(FT$2=1,Klimadaten!FT31,\"\")","v":""},null,null,null,{"$f":"IF(FX$2=1,Klimadaten!FX31,\"\")","v":""},null,null,null,{"$f":"IF(GB$2=1,Klimadaten!GB31,\"\")","v":""},null,null,null,{"$f":"IF(GF$2=1,Klimadaten!GF31,\"\")","v":""},null,null,null,{"$f":"IF(GJ$2=1,Klimadaten!GJ31,\"\")","v":""},null,null,null,{"$f":"IF(GN$2=1,Klimadaten!GN31,\"\")","v":""},null,null,null,{"$f":"IF(GR$2=1,Klimadaten!GR31,\"\")","v":""},null,null,null,{"$f":"IF(GV$2=1,Klimadaten!GV31,\"\")","v":""},null,null,null,{"$f":"IF(GZ$2=1,Klimadaten!GZ31,\"\")","v":""},null,null,null,{"$f":"IF(HD$2=1,Klimadaten!HD31,\"\")","v":""},null,null,null,{"$f":"IF(HH$2=1,Klimadaten!HH31,\"\")","v":""},null,null,null,{"$f":"IF(HL$2=1,Klimadaten!HL31,\"\")","v":13},null,null,null,null,null,null,null,null,null,null,null,null,null,null,null,null,null,null,null,{"$f":"IF(IF$2=1,Klimadaten!IF31,\"\")","v":""},null,null,null,{"$f":"IF(IJ$2=1,Klimadaten!IJ31,\"\")","v":""},null,null,null,{"$f":"IF(IN$2=1,Klimadaten!IN31,\"\")","v":""},null,null,null,{"$f":"IF(IR$2=1,Klimadaten!IR31,\"\")","v":""},null,null,null,{"$f":"IF(IV$2=1,Klimadaten!IV31,\"\")","v":""}]
[2,null,null,{"$f":"IF(D$2=1,Klimadaten!D32,\"\")","v":""},null,null,null,{"$f":"IF(H$2=1,Klimadaten!H32,\"\")","v":14},null,null,null,{"$f":"IF(L$2=1,Klimadaten!L32,\"\")","v":13},null,null,null,{"$f":"IF(P$2=1,Klimadaten!P32,\"\")","v":""},null,null,null,{"$f":"IF(T$2=1,Klimadaten!T32,\"\")","v":""},null,null,null,{"$f":"IF(X$2=1,Klimadaten!X32,\"\")","v":""},null,null,null,{"$f":"IF(AB$2=1,Klimadaten!AB32,\"\")","v":""},null,null,null,{"$f":"IF(AF$2=1,Klimadaten!AF32,\"\")","v":""},null,null,null,{"$f":"IF(AJ$2=1,Klimadaten!AJ32,\"\")","v":""},null,null,null,{"$f":"IF(AN$2=1,Klimadaten!AN32,\"\")","v":""},null,null,null,{"$f":"IF(AR$2=1,Klimadaten!AR32,\"\")","v":""},null,null,null,{"$f":"IF(AV$2=1,Klimadaten!AV32,\"\")","v":""},null,null,null,{"$f":"IF(AZ$2=1,Klimadaten!AZ32,\"\")","v":""},null,null,null,{"$f":"IF(BD$2=1,Klimadaten!BD32,\"\")","v":""},null,null,null,{"$f":"IF(BH$2=1,Klimadaten!BH32,\"\")","v":""},null,null,null,{"$f":"IF(BL$2=1,Klimadaten!BL32,\"\")","v":""},null,null,null,{"$f":"IF(BP$2=1,Klimadaten!BP32,\"\")","v":""},null,null,null,{"$f":"IF(BT$2=1,Klimadaten!BT32,\"\")","v":""},null,null,null,{"$f":"IF(BX$2=1,Klimadaten!BX32,\"\")","v":""},null,null,null,{"$f":"IF(CB$2=1,Klimadaten!CB32,\"\")","v":""},null,null,null,{"$f":"IF(CF$2=1,Klimadaten!CF32,\"\")","v":""},null,null,null,{"$f":"IF(CJ$2=1,Klimadaten!CJ32,\"\")","v":""},null,null,null,{"$f":"IF(CN$2=1,Klimadaten!CN32,\"\")","v":""},null,null,null,{"$f":"IF(CR$2=1,Klimadaten!CR32,\"\")","v":13},null,null,null,{"$f":"IF(CV$2=1,Klimadaten!CV32,\"\")","v":""},null,null,null,{"$f":"IF(CZ$2=1,Klimadaten!CZ32,\"\")","v":""},null,null,null,{"$f":"IF(DD$2=1,Klimadaten!DD32,\"\")","v":""},null,null,null,{"$f":"IF(DH$2=1,Klimadaten!DH32,\"\")","v":""},null,null,null,{"$f":"IF(DL$2=1,Klimadaten!DL32,\"\")","v":""},null,null,null,{"$f":"IF(DP$2=1,Klimadaten!DP32,\"\")","v":""},null,null,null,{"$f":"IF(DT$2=1,Klimadaten!DT32,\"\")","v":""},null,null,null,{"$f":"IF(DX$2=1,Klimadaten!DX32,\"\")","v":""},null,null,null,{"$f":"IF(EB$2=1,Klimadaten!EB32,\"\")","v":""},null,null,null,{"$f":"IF(EF$2=1,Klimadaten!EF32,\"\")","v":""},null,null,null,{"$f":"IF(EJ$2=1,Klimadaten!EJ32,\"\")","v":""},null,null,null,{"$f":"IF(EN$2=1,Klimadaten!EN32,\"\")","v":""},null,null,null,{"$f":"IF(ER$2=1,Klimadaten!ER32,\"\")","v":""},null,null,null,{"$f":"IF(EV$2=1,Klimadaten!EV32,\"\")","v":""},null,null,null,{"$f":"IF(EZ$2=1,Klimadaten!EZ32,\"\")","v":""},null,null,null,{"$f":"IF(FD$2=1,Klimadaten!FD32,\"\")","v":""},null,null,null,{"$f":"IF(FH$2=1,Klimadaten!FH32,\"\")","v":""},null,null,null,{"$f":"IF(FL$2=1,Klimadaten!FL32,\"\")","v":""},null,null,null,{"$f":"IF(FP$2=1,Klimadaten!FP32,\"\")","v":""},null,null,null,{"$f":"IF(FT$2=1,Klimadaten!FT32,\"\")","v":""},null,null,null,{"$f":"IF(FX$2=1,Klimadaten!FX32,\"\")","v":""},null,null,null,{"$f":"IF(GB$2=1,Klimadaten!GB32,\"\")","v":""},null,null,null,{"$f":"IF(GF$2=1,Klimadaten!GF32,\"\")","v":""},null,null,null,{"$f":"IF(GJ$2=1,Klimadaten!GJ32,\"\")","v":""},null,null,null,{"$f":"IF(GN$2=1,Klimadaten!GN32,\"\")","v":""},null,null,null,{"$f":"IF(GR$2=1,Klimadaten!GR32,\"\")","v":""},null,null,null,{"$f":"IF(GV$2=1,Klimadaten!GV32,\"\")","v":""},null,null,null,{"$f":"IF(GZ$2=1,Klimadaten!GZ32,\"\")","v":""},null,null,null,{"$f":"IF(HD$2=1,Klimadaten!HD32,\"\")","v":""},null,null,null,{"$f":"IF(HH$2=1,Klimadaten!HH32,\"\")","v":""},null,null,null,{"$f":"IF(HL$2=1,Klimadaten!HL32,\"\")","v":16},null,null,null,null,null,null,null,null,null,null,null,null,null,null,null,null,null,null,null,{"$f":"IF(IF$2=1,Klimadaten!IF32,\"\")","v":""},null,null,null,{"$f":"IF(IJ$2=1,Klimadaten!IJ32,\"\")","v":""},null,null,null,{"$f":"IF(IN$2=1,Klimadaten!IN32,\"\")","v":""},null,null,null,{"$f":"IF(IR$2=1,Klimadaten!IR32,\"\")","v":""},null,null,null,{"$f":"IF(IV$2=1,Klimadaten!IV32,\"\")","v":""}]
[3,null,null,{"$f":"IF(D$2=1,Klimadaten!D33,\"\")","v":""},null,null,null,{"$f":"IF(H$2=1,Klimadaten!H33,\"\")","v":17},null,null,null,{"$f":"IF(L$2=1,Klimadaten!L33,\"\")","v":15},null,null,null,{"$f":"IF(P$2=1,Klimadaten!P33,\"\")","v":""},null,null,null,{"$f":"IF(T$2=1,Klimadaten!T33,\"\")","v":""},null,null,null,{"$f":"IF(X$2=1,Klimadaten!X33,\"\")","v":""},null,null,null,{"$f":"IF(AB$2=1,Klimadaten!AB33,\"\")","v":""},null,null,null,{"$f":"IF(AF$2=1,Klimadaten!AF33,\"\")","v":""},null,null,null,{"$f":"IF(AJ$2=1,Klimadaten!AJ33,\"\")","v":""},null,null,null,{"$f":"IF(AN$2=1,Klimadaten!AN33,\"\")","v":""},null,null,null,{"$f":"IF(AR$2=1,Klimadaten!AR33,\"\")","v":""},null,null,null,{"$f":"IF(AV$2=1,Klimadaten!AV33,\"\")","v":""},null,null,null,{"$f":"IF(AZ$2=1,Klimadaten!AZ33,\"\")","v":""},null,null,null,{"$f":"IF(BD$2=1,Klimadaten!BD33,\"\")","v":""},null,null,null,{"$f":"IF(BH$2=1,Klimadaten!BH33,\"\")","v":""},null,null,null,{"$f":"IF(BL$2=1,Klimadaten!BL33,\"\")","v":""},null,null,null,{"$f":"IF(BP$2=1,Klimadaten!BP33,\"\")","v":""},null,null,null,{"$f":"IF(BT$2=1,Klimadaten!BT33,\"\")","v":""},null,null,null,{"$f":"IF(BX$2=1,Klimadaten!BX33,\"\")","v":""},null,null,null,{"$f":"IF(CB$2=1,Klimadaten!CB33,\"\")","v":""},null,null,null,{"$f":"IF(CF$2=1,Klimadaten!CF33,\"\")","v":""},null,null,null,{"$f":"IF(CJ$2=1,Klimadaten!CJ33,\"\")","v":""},null,null,null,{"$f":"IF(CN$2=1,Klimadaten!CN33,\"\")","v":""},null,null,null,{"$f":"IF(CR$2=1,Klimadaten!CR33,\"\")","v":15},null,null,null,{"$f":"IF(CV$2=1,Klimadaten!CV33,\"\")","v":""},null,null,null,{"$f":"IF(CZ$2=1,Klimadaten!CZ33,\"\")","v":""},null,null,null,{"$f":"IF(DD$2=1,Klimadaten!DD33,\"\")","v":""},null,null,null,{"$f":"IF(DH$2=1,Klimadaten!DH33,\"\")","v":""},null,null,null,{"$f":"IF(DL$2=1,Klimadaten!DL33,\"\")","v":""},null,null,null,{"$f":"IF(DP$2=1,Klimadaten!DP33,\"\")","v":""},null,null,null,{"$f":"IF(DT$2=1,Klimadaten!DT33,\"\")","v":""},null,null,null,{"$f":"IF(DX$2=1,Klimadaten!DX33,\"\")","v":""},null,null,null,{"$f":"IF(EB$2=1,Klimadaten!EB33,\"\")","v":""},null,null,null,{"$f":"IF(EF$2=1,Klimadaten!EF33,\"\")","v":""},null,null,null,{"$f":"IF(EJ$2=1,Klimadaten!EJ33,\"\")","v":""},null,null,null,{"$f":"IF(EN$2=1,Klimadaten!EN33,\"\")","v":""},null,null,null,{"$f":"IF(ER$2=1,Klimadaten!ER33,\"\")","v":""},null,null,null,{"$f":"IF(EV$2=1,Klimadaten!EV33,\"\")","v":""},null,null,null,{"$f":"IF(EZ$2=1,Klimadaten!EZ33,\"\")","v":""},null,null,null,{"$f":"IF(FD$2=1,Klimadaten!FD33,\"\")","v":""},null,null,null,{"$f":"IF(FH$2=1,Klimadaten!FH33,\"\")","v":""},null,null,null,{"$f":"IF(FL$2=1,Klimadaten!FL33,\"\")","v":""},null,null,null,{"$f":"IF(FP$2=1,Klimadaten!FP33,\"\")","v":""},null,null,null,{"$f":"IF(FT$2=1,Klimadaten!FT33,\"\")","v":""},null,null,null,{"$f":"IF(FX$2=1,Klimadaten!FX33,\"\")","v":""},null,null,null,{"$f":"IF(GB$2=1,Klimadaten!GB33,\"\")","v":""},null,null,null,{"$f":"IF(GF$2=1,Klimadaten!GF33,\"\")","v":""},null,null,null,{"$f":"IF(GJ$2=1,Klimadaten!GJ33,\"\")","v":""},null,null,null,{"$f":"IF(GN$2=1,Klimadaten!GN33,\"\")","v":""},null,null,null,{"$f":"IF(GR$2=1,Klimadaten!GR33,\"\")","v":""},null,null,null,{"$f":"IF(GV$2=1,Klimadaten!GV33,\"\")","v":""},null,null,null,{"$f":"IF(GZ$2=1,Klimadaten!GZ33,\"\")","v":""},null,null,null,{"$f":"IF(HD$2=1,Klimadaten!HD33,\"\")","v":""},null,null,null,{"$f":"IF(HH$2=1,Klimadaten!HH33,\"\")","v":""},null,null,null,{"$f":"IF(HL$2=1,Klimadaten!HL33,\"\")","v":11},null,null,null,null,null,null,null,null,null,null,null,null,null,null,null,null,null,null,null,{"$f":"IF(IF$2=1,Klimadaten!IF33,\"\")","v":""},null,null,null,{"$f":"IF(IJ$2=1,Klimadaten!IJ33,\"\")","v":""},null,null,null,{"$f":"IF(IN$2=1,Klimadaten!IN33,\"\")","v":""},null,null,null,{"$f":"IF(IR$2=1,Klimadaten!IR33,\"\")","v":""},null,null,null,{"$f":"IF(IV$2=1,Klimadaten!IV33,\"\")","v":""}]
[4,null,null,{"$f":"IF(D$2=1,Klimadaten!D34,\"\")","v":""},null,null,null,{"$f":"IF(H$2=1,Klimadaten!H34,\"\")","v":13},null,null,null,{"$f":"IF(L$2=1,Klimadaten!L34,\"\")","v":16},null,null,null,{"$f":"IF(P$2=1,Klimadaten!P34,\"\")","v":""},null,null,null,{"$f":"IF(T$2=1,Klimadaten!T34,\"\")","v":""},null,null,null,{"$f":"IF(X$2=1,Klimadaten!X34,\"\")","v":""},null,null,null,{"$f":"IF(AB$2=1,Klimadaten!AB34,\"\")","v":""},null,null,null,{"$f":"IF(AF$2=1,Klimadaten!AF34,\"\")","v":""},null,null,null,{"$f":"IF(AJ$2=1,Klimadaten!AJ34,\"\")","v":""},null,null,null,{"$f":"IF(AN$2=1,Klimadaten!AN34,\"\")","v":""},null,null,null,{"$f":"IF(AR$2=1,Klimadaten!AR34,\"\")","v":""},null,null,null,{"$f":"IF(AV$2=1,Klimadaten!AV34,\"\")","v":""},null,null,null,{"$f":"IF(AZ$2=1,Klimadaten!AZ34,\"\")","v":""},null,null,null,{"$f":"IF(BD$2=1,Klimadaten!BD34,\"\")","v":""},null,null,null,{"$f":"IF(BH$2=1,Klimadaten!BH34,\"\")","v":""},null,null,null,{"$f":"IF(BL$2=1,Klimadaten!BL34,\"\")","v":""},null,null,null,{"$f":"IF(BP$2=1,Klimadaten!BP34,\"\")","v":""},null,null,null,{"$f":"IF(BT$2=1,Klimadaten!BT34,\"\")","v":""},null,null,null,{"$f":"IF(BX$2=1,Klimadaten!BX34,\"\")","v":""},null,null,null,{"$f":"IF(CB$2=1,Klimadaten!CB34,\"\")","v":""},null,null,null,{"$f":"IF(CF$2=1,Klimadaten!CF34,\"\")","v":""},null,null,null,{"$f":"IF(CJ$2=1,Klimadaten!CJ34,\"\")","v":""},null,null,null,{"$f":"IF(CN$2=1,Klimadaten!CN34,\"\")","v":""},null,null,null,{"$f":"IF(CR$2=1,Klimadaten!CR34,\"\")","v":16},null,null,null,{"$f":"IF(CV$2=1,Klimadaten!CV34,\"\")","v":""},null,null,null,{"$f":"IF(CZ$2=1,Klimadaten!CZ34,\"\")","v":""},null,null,null,{"$f":"IF(DD$2=1,Klimadaten!DD34,\"\")","v":""},null,null,null,{"$f":"IF(DH$2=1,Klimadaten!DH34,\"\")","v":""},null,null,null,{"$f":"IF(DL$2=1,Klimadaten!DL34,\"\")","v":""},null,null,null,{"$f":"IF(DP$2=1,Klimadaten!DP34,\"\")","v":""},null,null,null,{"$f":"IF(DT$2=1,Klimadaten!DT34,\"\")","v":""},null,null,null,{"$f":"IF(DX$2=1,Klimadaten!DX34,\"\")","v":""},null,null,null,{"$f":"IF(EB$2=1,Klimadaten!EB34,\"\")","v":""},null,null,null,{"$f":"IF(EF$2=1,Klimadaten!EF34,\"\")","v":""},null,null,null,{"$f":"IF(EJ$2=1,Klimadaten!EJ34,\"\")","v":""},null,null,null,{"$f":"IF(EN$2=1,Klimadaten!EN34,\"\")","v":""},null,null,null,{"$f":"IF(ER$2=1,Klimadaten!ER34,\"\")","v":""},null,null,null,{"$f":"IF(EV$2=1,Klimadaten!EV34,\"\")","v":""},null,null,null,{"$f":"IF(EZ$2=1,Klimadaten!EZ34,\"\")","v":""},null,null,null,{"$f":"IF(FD$2=1,Klimadaten!FD34,\"\")","v":""},null,null,null,{"$f":"IF(FH$2=1,Klimadaten!FH34,\"\")","v":""},null,null,null,{"$f":"IF(FL$2=1,Klimadaten!FL34,\"\")","v":""},null,null,null,{"$f":"IF(FP$2=1,Klimadaten!FP34,\"\")","v":""},null,null,null,{"$f":"IF(FT$2=1,Klimadaten!FT34,\"\")","v":""},null,null,null,{"$f":"IF(FX$2=1,Klimadaten!FX34,\"\")","v":""},null,null,null,{"$f":"IF(GB$2=1,Klimadaten!GB34,\"\")","v":""},null,null,null,{"$f":"IF(GF$2=1,Klimadaten!GF34,\"\")","v":""},null,null,null,{"$f":"IF(GJ$2=1,Klimadaten!GJ34,\"\")","v":""},null,null,null,{"$f":"IF(GN$2=1,Klimadaten!GN34,\"\")","v":""},null,null,null,{"$f":"IF(GR$2=1,Klimadaten!GR34,\"\")","v":""},null,null,null,{"$f":"IF(GV$2=1,Klimadaten!GV34,\"\")","v":""},null,null,null,{"$f":"IF(GZ$2=1,Klimadaten!GZ34,\"\")","v":""},null,null,null,{"$f":"IF(HD$2=1,Klimadaten!HD34,\"\")","v":""},null,null,null,{"$f":"IF(HH$2=1,Klimadaten!HH34,\"\")","v":""},null,null,null,{"$f":"IF(HL$2=1,Klimadaten!HL34,\"\")","v":10},null,null,null,null,null,null,null,null,null,null,null,null,null,null,null,null,null,null,null,{"$f":"IF(IF$2=1,Klimadaten!IF34,\"\")","v":""},null,null,null,{"$f":"IF(IJ$2=1,Klimadaten!IJ34,\"\")","v":""},null,null,null,{"$f":"IF(IN$2=1,Klimadaten!IN34,\"\")","v":""},null,null,null,{"$f":"IF(IR$2=1,Klimadaten!IR34,\"\")","v":""},null,null,null,{"$f":"IF(IV$2=1,Klimadaten!IV34,\"\")","v":""}]
[5,null,null,{"$f":"IF(D$2=1,Klimadaten!D35,\"\")","v":""},null,null,null,{"$f":"IF(H$2=1,Klimadaten!H35,\"\")","v":12},null,null,null,{"$f":"IF(L$2=1,Klimadaten!L35,\"\")","v":17},null,null,null,{"$f":"IF(P$2=1,Klimadaten!P35,\"\")","v":""},null,null,null,{"$f":"IF(T$2=1,Klimadaten!T35,\"\")","v":""},null,null,null,{"$f":"IF(X$2=1,Klimadaten!X35,\"\")","v":""},null,null,null,{"$f":"IF(AB$2=1,Klimadaten!AB35,\"\")","v":""},null,null,null,{"$f":"IF(AF$2=1,Klimadaten!AF35,\"\")","v":""},null,null,null,{"$f":"IF(AJ$2=1,Klimadaten!AJ35,\"\")","v":""},null,null,null,{"$f":"IF(AN$2=1,Klimadaten!AN35,\"\")","v":""},null,null,null,{"$f":"IF(AR$2=1,Klimadaten!AR35,\"\")","v":""},null,null,null,{"$f":"IF(AV$2=1,Klimadaten!AV35,\"\")","v":""},null,null,null,{"$f":"IF(AZ$2=1,Klimadaten!AZ35,\"\")","v":""},null,null,null,{"$f":"IF(BD$2=1,Klimadaten!BD35,\"\")","v":""},null,null,null,{"$f":"IF(BH$2=1,Klimadaten!BH35,\"\")","v":""},null,null,null,{"$f":"IF(BL$2=1,Klimadaten!BL35,\"\")","v":""},null,null,null,{"$f":"IF(BP$2=1,Klimadaten!BP35,\"\")","v":""},null,null,null,{"$f":"IF(BT$2=1,Klimadaten!BT35,\"\")","v":""},null,null,null,{"$f":"IF(BX$2=1,Klimadaten!BX35,\"\")","v":""},null,null,null,{"$f":"IF(CB$2=1,Klimadaten!CB35,\"\")","v":""},null,null,null,{"$f":"IF(CF$2=1,Klimadaten!CF35,\"\")","v":""},null,null,null,{"$f":"IF(CJ$2=1,Klimadaten!CJ35,\"\")","v":""},null,null,null,{"$f":"IF(CN$2=1,Klimadaten!CN35,\"\")","v":""},null,null,null,{"$f":"IF(CR$2=1,Klimadaten!CR35,\"\")","v":15},null,null,null,{"$f":"IF(CV$2=1,Klimadaten!CV35,\"\")","v":""},null,null,null,{"$f":"IF(CZ$2=1,Klimadaten!CZ35,\"\")","v":""},null,null,null,{"$f":"IF(DD$2=1,Klimadaten!DD35,\"\")","v":""},null,null,null,{"$f":"IF(DH$2=1,Klimadaten!DH35,\"\")","v":""},null,null,null,{"$f":"IF(DL$2=1,Klimadaten!DL35,\"\")","v":""},null,null,null,{"$f":"IF(DP$2=1,Klimadaten!DP35,\"\")","v":""},null,null,null,{"$f":"IF(DT$2=1,Klimadaten!DT35,\"\")","v":""},null,null,null,{"$f":"IF(DX$2=1,Klimadaten!DX35,\"\")","v":""},null,null,null,{"$f":"IF(EB$2=1,Klimadaten!EB35,\"\")","v":""},null,null,null,{"$f":"IF(EF$2=1,Klimadaten!EF35,\"\")","v":""},null,null,null,{"$f":"IF(EJ$2=1,Klimadaten!EJ35,\"\")","v":""},null,null,null,{"$f":"IF(EN$2=1,Klimadaten!EN35,\"\")","v":""},null,null,null,{"$f":"IF(ER$2=1,Klimadaten!ER35,\"\")","v":""},null,null,null,{"$f":"IF(EV$2=1,Klimadaten!EV35,\"\")","v":""},null,null,null,{"$f":"IF(EZ$2=1,Klimadaten!EZ35,\"\")","v":""},null,null,null,{"$f":"IF(FD$2=1,Klimadaten!FD35,\"\")","v":""},null,null,null,{"$f":"IF(FH$2=1,Klimadaten!FH35,\"\")","v":""},null,null,null,{"$f":"IF(FL$2=1,Klimadaten!FL35,\"\")","v":""},null,null,null,{"$f":"IF(FP$2=1,Klimadaten!FP35,\"\")","v":""},null,null,null,{"$f":"IF(FT$2=1,Klimadaten!FT35,\"\")","v":""},null,null,null,{"$f":"IF(FX$2=1,Klimadaten!FX35,\"\")","v":""},null,null,null,{"$f":"IF(GB$2=1,Klimadaten!GB35,\"\")","v":""},null,null,null,{"$f":"IF(GF$2=1,Klimadaten!GF35,\"\")","v":""},null,null,null,{"$f":"IF(GJ$2=1,Klimadaten!GJ35,\"\")","v":""},null,null,null,{"$f":"IF(GN$2=1,Klimadaten!GN35,\"\")","v":""},null,null,null,{"$f":"IF(GR$2=1,Klimadaten!GR35,\"\")","v":""},null,null,null,{"$f":"IF(GV$2=1,Klimadaten!GV35,\"\")","v":""},null,null,null,{"$f":"IF(GZ$2=1,Klimadaten!GZ35,\"\")","v":""},null,null,null,{"$f":"IF(HD$2=1,Klimadaten!HD35,\"\")","v":""},null,null,null,{"$f":"IF(HH$2=1,Klimadaten!HH35,\"\")","v":""},null,null,null,{"$f":"IF(HL$2=1,Klimadaten!HL35,\"\")","v":13},null,null,null,null,null,null,null,null,null,null,null,null,null,null,null,null,null,null,null,{"$f":"IF(IF$2=1,Klimadaten!IF35,\"\")","v":""},null,null,null,{"$f":"IF(IJ$2=1,Klimadaten!IJ35,\"\")","v":""},null,null,null,{"$f":"IF(IN$2=1,Klimadaten!IN35,\"\")","v":""},null,null,null,{"$f":"IF(IR$2=1,Klimadaten!IR35,\"\")","v":""},null,null,null,{"$f":"IF(IV$2=1,Klimadaten!IV35,\"\")","v":""}]
[6,null,null,{"$f":"IF(D$2=1,Klimadaten!D36,\"\")","v":""},null,null,null,{"$f":"IF(H$2=1,Klimadaten!H36,\"\")","v":14},null,null,null,{"$f":"IF(L$2=1,Klimadaten!L36,\"\")","v":13},null,null,null,{"$f":"IF(P$2=1,Klimadaten!P36,\"\")","v":""},null,null,null,{"$f":"IF(T$2=1,Klimadaten!T36,\"\")","v":""},null,null,null,{"$f":"IF(X$2=1,Klimadaten!X36,\"\")","v":""},null,null,null,{"$f":"IF(AB$2=1,Klimadaten!AB36,\"\")","v":""},null,null,null,{"$f":"IF(AF$2=1,Klimadaten!AF36,\"\")","v":""},null,null,null,{"$f":"IF(AJ$2=1,Klimadaten!AJ36,\"\")","v":""},null,null,null,{"$f":"IF(AN$2=1,Klimadaten!AN36,\"\")","v":""},null,null,null,{"$f":"IF(AR$2=1,Klimadaten!AR36,\"\")","v":""},null,null,null,{"$f":"IF(AV$2=1,Klimadaten!AV36,\"\")","v":""},null,null,null,{"$f":"IF(AZ$2=1,Klimadaten!AZ36,\"\")","v":""},null,null,null,{"$f":"IF(BD$2=1,Klimadaten!BD36,\"\")","v":""},null,null,null,{"$f":"IF(BH$2=1,Klimadaten!BH36,\"\")","v":""},null,null,null,{"$f":"IF(BL$2=1,Klimadaten!BL36,\"\")","v":""},null,null,null,{"$f":"IF(BP$2=1,Klimadaten!BP36,\"\")","v":""},null,null,null,{"$f":"IF(BT$2=1,Klimadaten!BT36,\"\")","v":""},null,null,null,{"$f":"IF(BX$2=1,Klimadaten!BX36,\"\")","v":""},null,null,null,{"$f":"IF(CB$2=1,Klimadaten!CB36,\"\")","v":""},null,null,null,{"$f":"IF(CF$2=1,Klimadaten!CF36,\"\")","v":""},null,null,null,{"$f":"IF(CJ$2=1,Klimadaten!CJ36,\"\")","v":""},null,null,null,{"$f":"IF(CN$2=1,Klimadaten!CN36,\"\")","v":""},null,null,null,{"$f":"IF(CR$2=1,Klimadaten!CR36,\"\")","v":15},null,null,null,{"$f":"IF(CV$2=1,Klimadaten!CV36,\"\")","v":""},null,null,null,{"$f":"IF(CZ$2=1,Klimadaten!CZ36,\"\")","v":""},null,null,null,{"$f":"IF(DD$2=1,Klimadaten!DD36,\"\")","v":""},null,null,null,{"$f":"IF(DH$2=1,Klimadaten!DH36,\"\")","v":""},null,null,null,{"$f":"IF(DL$2=1,Klimadaten!DL36,\"\")","v":""},null,null,null,{"$f":"IF(DP$2=1,Klimadaten!DP36,\"\")","v":""},null,null,null,{"$f":"IF(DT$2=1,Klimadaten!DT36,\"\")","v":""},null,null,null,{"$f":"IF(DX$2=1,Klimadaten!DX36,\"\")","v":""},null,null,null,{"$f":"IF(EB$2=1,Klimadaten!EB36,\"\")","v":""},null,null,null,{"$f":"IF(EF$2=1,Klimadaten!EF36,\"\")","v":""},null,null,null,{"$f":"IF(EJ$2=1,Klimadaten!EJ36,\"\")","v":""},null,null,null,{"$f":"IF(EN$2=1,Klimadaten!EN36,\"\")","v":""},null,null,null,{"$f":"IF(ER$2=1,Klimadaten!ER36,\"\")","v":""},null,null,null,{"$f":"IF(EV$2=1,Klimadaten!EV36,\"\")","v":""},null,null,null,{"$f":"IF(EZ$2=1,Klimadaten!EZ36,\"\")","v":""},null,null,null,{"$f":"IF(FD$2=1,Klimadaten!FD36,\"\")","v":""},null,null,null,{"$f":"IF(FH$2=1,Klimadaten!FH36,\"\")","v":""},null,null,null,{"$f":"IF(FL$2=1,Klimadaten!FL36,\"\")","v":""},null,null,null,{"$f":"IF(FP$2=1,Klimadaten!FP36,\"\")","v":""},null,null,null,{"$f":"IF(FT$2=1,Klimadaten!FT36,\"\")","v":""},null,null,null,{"$f":"IF(FX$2=1,Klimadaten!FX36,\"\")","v":""},null,null,null,{"$f":"IF(GB$2=1,Klimadaten!GB36,\"\")","v":""},null,null,null,{"$f":"IF(GF$2=1,Klimadaten!GF36,\"\")","v":""},null,null,null,{"$f":"IF(GJ$2=1,Klimadaten!GJ36,\"\")","v":""},null,null,null,{"$f":"IF(GN$2=1,Klimadaten!GN36,\"\")","v":""},null,null,null,{"$f":"IF(GR$2=1,Klimadaten!GR36,\"\")","v":""},null,null,null,{"$f":"IF(GV$2=1,Klimadaten!GV36,\"\")","v":""},null,null,null,{"$f":"IF(GZ$2=1,Klimadaten!GZ36,\"\")","v":""},null,null,null,{"$f":"IF(HD$2=1,Klimadaten!HD36,\"\")","v":""},null,null,null,{"$f":"IF(HH$2=1,Klimadaten!HH36,\"\")","v":""},null,null,null,{"$f":"IF(HL$2=1,Klimadaten!HL36,\"\")","v":13},null,null,null,null,null,null,null,null,null,null,null,null,null,null,null,null,null,null,null,{"$f":"IF(IF$2=1,Klimadaten!IF36,\"\")","v":""},null,null,null,{"$f":"IF(IJ$2=1,Klimadaten!IJ36,\"\")","v":""},null,null,null,{"$f":"IF(IN$2=1,Klimadaten!IN36,\"\")","v":""},null,null,null,{"$f":"IF(IR$2=1,Klimadaten!IR36,\"\")","v":""},null,null,null,{"$f":"IF(IV$2=1,Klimadaten!IV36,\"\")","v":""}]
[7,null,null,{"$f":"IF(D$2=1,Klimadaten!D37,\"\")","v":""},null,null,null,{"$f":"IF(H$2=1,Klimadaten!H37,\"\")","v":15},null,null,null,{"$f":"IF(L$2=1,Klimadaten!L37,\"\")","v":17},null,null,null,{"$f":"IF(P$2=1,Klimadaten!P37,\"\")","v":""},null,null,null,{"$f":"IF(T$2=1,Klimadaten!T37,\"\")","v":""},null,null,null,{"$f":"IF(X$2=1,Klimadaten!X37,\"\")","v":""},null,null,null,{"$f":"IF(AB$2=1,Klimadaten!AB37,\"\")","v":""},null,null,null,{"$f":"IF(AF$2=1,Klimadaten!AF37,\"\")","v":""},null,null,null,{"$f":"IF(AJ$2=1,Klimadaten!AJ37,\"\")","v":""},null,null,null,{"$f":"IF(AN$2=1,Klimadaten!AN37,\"\")","v":""},null,null,null,{"$f":"IF(AR$2=1,Klimadaten!AR37,\"\")","v":""},null,null,null,{"$f":"IF(AV$2=1,Klimadaten!AV37,\"\")","v":""},null,null,null,{"$f":"IF(AZ$2=1,Klimadaten!AZ37,\"\")","v":""},null,null,null,{"$f":"IF(BD$2=1,Klimadaten!BD37,\"\")","v":""},null,null,null,{"$f":"IF(BH$2=1,Klimadaten!BH37,\"\")","v":""},null,null,null,{"$f":"IF(BL$2=1,Klimadaten!BL37,\"\")","v":""},null,null,null,{"$f":"IF(BP$2=1,Klimadaten!BP37,\"\")","v":""},null,null,null,{"$f":"IF(BT$2=1,Klimadaten!BT37,\"\")","v":""},null,null,null,{"$f":"IF(BX$2=1,Klimadaten!BX37,\"\")","v":""},null,null,null,{"$f":"IF(CB$2=1,Klimadaten!CB37,\"\")","v":""},null,null,null,{"$f":"IF(CF$2=1,Klimadaten!CF37,\"\")","v":""},null,null,null,{"$f":"IF(CJ$2=1,Klimadaten!CJ37,\"\")","v":""},null,null,null,{"$f":"IF(CN$2=1,Klimadaten!CN37,\"\")","v":""},null,null,null,{"$f":"IF(CR$2=1,Klimadaten!CR37,\"\")","v":15},null,null,null,{"$f":"IF(CV$2=1,Klimadaten!CV37,\"\")","v":""},null,null,null,{"$f":"IF(CZ$2=1,Klimadaten!CZ37,\"\")","v":""},null,null,null,{"$f":"IF(DD$2=1,Klimadaten!DD37,\"\")","v":""},null,null,null,{"$f":"IF(DH$2=1,Klimadaten!DH37,\"\")","v":""},null,null,null,{"$f":"IF(DL$2=1,Klimadaten!DL37,\"\")","v":""},null,null,null,{"$f":"IF(DP$2=1,Klimadaten!DP37,\"\")","v":""},null,null,null,{"$f":"IF(DT$2=1,Klimadaten!DT37,\"\")","v":""},null,null,null,{"$f":"IF(DX$2=1,Klimadaten!DX37,\"\")","v":""},null,null,null,{"$f":"IF(EB$2=1,Klimadaten!EB37,\"\")","v":""},null,null,null,{"$f":"IF(EF$2=1,Klimadaten!EF37,\"\")","v":""},null,null,null,{"$f":"IF(EJ$2=1,Klimadaten!EJ37,\"\")","v":""},null,null,null,{"$f":"IF(EN$2=1,Klimadaten!EN37,\"\")","v":""},null,null,null,{"$f":"IF(ER$2=1,Klimadaten!ER37,\"\")","v":""},null,null,null,{"$f":"IF(EV$2=1,Klimadaten!EV37,\"\")","v":""},null,null,null,{"$f":"IF(EZ$2=1,Klimadaten!EZ37,\"\")","v":""},null,null,null,{"$f":"IF(FD$2=1,Klimadaten!FD37,\"\")","v":""},null,null,null,{"$f":"IF(FH$2=1,Klimadaten!FH37,\"\")","v":""},null,null,null,{"$f":"IF(FL$2=1,Klimadaten!FL37,\"\")","v":""},null,null,null,{"$f":"IF(FP$2=1,Klimadaten!FP37,\"\")","v":""},null,null,null,{"$f":"IF(FT$2=1,Klimadaten!FT37,\"\")","v":""},null,null,null,{"$f":"IF(FX$2=1,Klimadaten!FX37,\"\")","v":""},null,null,null,{"$f":"IF(GB$2=1,Klimadaten!GB37,\"\")","v":""},null,null,null,{"$f":"IF(GF$2=1,Klimadaten!GF37,\"\")","v":""},null,null,null,{"$f":"IF(GJ$2=1,Klimadaten!GJ37,\"\")","v":""},null,null,null,{"$f":"IF(GN$2=1,Klimadaten!GN37,\"\")","v":""},null,null,null,{"$f":"IF(GR$2=1,Klimadaten!GR37,\"\")","v":""},null,null,null,{"$f":"IF(GV$2=1,Klimadaten!GV37,\"\")","v":""},null,null,null,{"$f":"IF(GZ$2=1,Klimadaten!GZ37,\"\")","v":""},null,null,null,{"$f":"IF(HD$2=1,Klimadaten!HD37,\"\")","v":""},null,null,null,{"$f":"IF(HH$2=1,Klimadaten!HH37,\"\")","v":""},null,null,null,{"$f":"IF(HL$2=1,Klimadaten!HL37,\"\")","v":11},null,null,null,null,null,null,null,null,null,null,null,null,null,null,null,null,null,null,null,{"$f":"IF(IF$2=1,Klimadaten!IF37,\"\")","v":""},null,null,null,{"$f":"IF(IJ$2=1,Klimadaten!IJ37,\"\")","v":""},null,null,null,{"$f":"IF(IN$2=1,Klimadaten!IN37,\"\")","v":""},null,null,null,{"$f":"IF(IR$2=1,Klimadaten!IR37,\"\")","v":""},null,null,null,{"$f":"IF(IV$2=1,Klimadaten!IV37,\"\")","v":""}]
[8,null,null,{"$f":"IF(D$2=1,Klimadaten!D38,\"\")","v":""},null,null,null,{"$f":"IF(H$2=1,Klimadaten!H38,\"\")","v":14},null,null,null,{"$f":"IF(L$2=1,Klimadaten!L38,\"\")","v":15},null,null,null,{"$f":"IF(P$2=1,Klimadaten!P38,\"\")","v":""},null,null,null,{"$f":"IF(T$2=1,Klimadaten!T38,\"\")","v":""},null,null,null,{"$f":"IF(X$2=1,Klimadaten!X38,\"\")","v":""},null,null,null,{"$f":"IF(AB$2=1,Klimadaten!AB38,\"\")","v":""},null,null,null,{"$f":"IF(AF$2=1,Klimadaten!AF38,\"\")","v":""},null,null,null,{"$f":"IF(AJ$2=1,Klimadaten!AJ38,\"\")","v":""},null,null,null,{"$f":"IF(AN$2=1,Klimadaten!AN38,\"\")","v":""},null,null,null,{"$f":"IF(AR$2=1,Klimadaten!AR38,\"\")","v":""},null,null,null,{"$f":"IF(AV$2=1,Klimadaten!AV38,\"\")","v":""},null,null,null,{"$f":"IF(AZ$2=1,Klimadaten!AZ38,\"\")","v":""},null,null,null,{"$f":"IF(BD$2=1,Klimadaten!BD38,\"\")","v":""},null,null,null,{"$f":"IF(BH$2=1,Klimadaten!BH38,\"\")","v":""},null,null,null,{"$f":"IF(BL$2=1,Klimadaten!BL38,\"\")","v":""},null,null,null,{"$f":"IF(BP$2=1,Klimadaten!BP38,\"\")","v":""},null,null,null,{"$f":"IF(BT$2=1,Klimadaten!BT38,\"\")","v":""},null,null,null,{"$f":"IF(BX$2=1,Klimadaten!BX38,\"\")","v":""},null,null,null,{"$f":"IF(CB$2=1,Klimadaten!CB38,\"\")","v":""},null,null,null,{"$f":"IF(CF$2=1,Klimadaten!CF38,\"\")","v":""},null,null,null,{"$f":"IF(CJ$2=1,Klimadaten!CJ38,\"\")","v":""},null,null,null,{"$f":"IF(CN$2=1,Klimadaten!CN38,\"\")","v":""},null,null,null,{"$f":"IF(CR$2=1,Klimadaten!CR38,\"\")","v":15},null,null,null,{"$f":"IF(CV$2=1,Klimadaten!CV38,\"\")","v":""},null,null,null,{"$f":"IF(CZ$2=1,Klimadaten!CZ38,\"\")","v":""},null,null,null,{"$f":"IF(DD$2=1,Klimadaten!DD38,\"\")","v":""},null,null,null,{"$f":"IF(DH$2=1,Klimadaten!DH38,\"\")","v":""},null,null,null,{"$f":"IF(DL$2=1,Klimadaten!DL38,\"\")","v":""},null,null,null,{"$f":"IF(DP$2=1,Klimadaten!DP38,\"\")","v":""},null,null,null,{"$f":"IF(DT$2=1,Klimadaten!DT38,\"\")","v":""},null,null,null,{"$f":"IF(DX$2=1,Klimadaten!DX38,\"\")","v":""},null,null,null,{"$f":"IF(EB$2=1,Klimadaten!EB38,\"\")","v":""},null,null,null,{"$f":"IF(EF$2=1,Klimadaten!EF38,\"\")","v":""},null,null,null,{"$f":"IF(EJ$2=1,Klimadaten!EJ38,\"\")","v":""},null,null,null,{"$f":"IF(EN$2=1,Klimadaten!EN38,\"\")","v":""},null,null,null,{"$f":"IF(ER$2=1,Klimadaten!ER38,\"\")","v":""},null,null,null,{"$f":"IF(EV$2=1,Klimadaten!EV38,\"\")","v":""},null,null,null,{"$f":"IF(EZ$2=1,Klimadaten!EZ38,\"\")","v":""},null,null,null,{"$f":"IF(FD$2=1,Klimadaten!FD38,\"\")","v":""},null,null,null,{"$f":"IF(FH$2=1,Klimadaten!FH38,\"\")","v":""},null,null,null,{"$f":"IF(FL$2=1,Klimadaten!FL38,\"\")","v":""},null,null,null,{"$f":"IF(FP$2=1,Klimadaten!FP38,\"\")","v":""},null,null,null,{"$f":"IF(FT$2=1,Klimadaten!FT38,\"\")","v":""},null,null,null,{"$f":"IF(FX$2=1,Klimadaten!FX38,\"\")","v":""},null,null,null,{"$f":"IF(GB$2=1,Klimadaten!GB38,\"\")","v":""},null,null,null,{"$f":"IF(GF$2=1,Klimadaten!GF38,\"\")","v":""},null,null,null,{"$f":"IF(GJ$2=1,Klimadaten!GJ38,\"\")","v":""},null,null,null,{"$f":"IF(GN$2=1,Klimadaten!GN38,\"\")","v":""},null,null,null,{"$f":"IF(GR$2=1,Klimadaten!GR38,\"\")","v":""},null,null,null,{"$f":"IF(GV$2=1,Klimadaten!GV38,\"\")","v":""},null,null,null,{"$f":"IF(GZ$2=1,Klimadaten!GZ38,\"\")","v":""},null,null,null,{"$f":"IF(HD$2=1,Klimadaten!HD38,\"\")","v":""},null,null,null,{"$f":"IF(HH$2=1,Klimadaten!HH38,\"\")","v":""},null,null,null,{"$f":"IF(HL$2=1,Klimadaten!HL38,\"\")","v":15},null,null,null,null,null,null,null,null,null,null,null,null,null,null,null,null,null,null,null,{"$f":"IF(IF$2=1,Klimadaten!IF38,\"\")","v":""},null,null,null,{"$f":"IF(IJ$2=1,Klimadaten!IJ38,\"\")","v":""},null,null,null,{"$f":"IF(IN$2=1,Klimadaten!IN38,\"\")","v":""},null,null,null,{"$f":"IF(IR$2=1,Klimadaten!IR38,\"\")","v":""},null,null,null,{"$f":"IF(IV$2=1,Klimadaten!IV38,\"\")","v":""}]
[9,null,null,{"$f":"IF(D$2=1,Klimadaten!D39,\"\")","v":""},null,null,null,{"$f":"IF(H$2=1,Klimadaten!H39,\"\")","v":15},null,null,null,{"$f":"IF(L$2=1,Klimadaten!L39,\"\")","v":12},null,null,null,{"$f":"IF(P$2=1,Klimadaten!P39,\"\")","v":""},null,null,null,{"$f":"IF(T$2=1,Klimadaten!T39,\"\")","v":""},null,null,null,{"$f":"IF(X$2=1,Klimadaten!X39,\"\")","v":""},null,null,null,{"$f":"IF(AB$2=1,Klimadaten!AB39,\"\")","v":""},null,null,null,{"$f":"IF(AF$2=1,Klimadaten!AF39,\"\")","v":""},null,null,null,{"$f":"IF(AJ$2=1,Klimadaten!AJ39,\"\")","v":""},null,null,null,{"$f":"IF(AN$2=1,Klimadaten!AN39,\"\")","v":""},null,null,null,{"$f":"IF(AR$2=1,Klimadaten!AR39,\"\")","v":""},null,null,null,{"$f":"IF(AV$2=1,Klimadaten!AV39,\"\")","v":""},null,null,null,{"$f":"IF(AZ$2=1,Klimadaten!AZ39,\"\")","v":""},null,null,null,{"$f":"IF(BD$2=1,Klimadaten!BD39,\"\")","v":""},null,null,null,{"$f":"IF(BH$2=1,Klimadaten!BH39,\"\")","v":""},null,null,null,{"$f":"IF(BL$2=1,Klimadaten!BL39,\"\")","v":""},null,null,null,{"$f":"IF(BP$2=1,Klimadaten!BP39,\"\")","v":""},null,null,null,{"$f":"IF(BT$2=1,Klimadaten!BT39,\"\")","v":""},null,null,null,{"$f":"IF(BX$2=1,Klimadaten!BX39,\"\")","v":""},null,null,null,{"$f":"IF(CB$2=1,Klimadaten!CB39,\"\")","v":""},null,null,null,{"$f":"IF(CF$2=1,Klimadaten!CF39,\"\")","v":""},null,null,null,{"$f":"IF(CJ$2=1,Klimadaten!CJ39,\"\")","v":""},null,null,null,{"$f":"IF(CN$2=1,Klimadaten!CN39,\"\")","v":""},null,null,null,{"$f":"IF(CR$2=1,Klimadaten!CR39,\"\")","v":19},null,null,null,{"$f":"IF(CV$2=1,Klimadaten!CV39,\"\")","v":""},null,null,null,{"$f":"IF(CZ$2=1,Klimadaten!CZ39,\"\")","v":""},null,null,null,{"$f":"IF(DD$2=1,Klimadaten!DD39,\"\")","v":""},null,null,null,{"$f":"IF(DH$2=1,Klimadaten!DH39,\"\")","v":""},null,null,null,{"$f":"IF(DL$2=1,Klimadaten!DL39,\"\")","v":""},null,null,null,{"$f":"IF(DP$2=1,Klimadaten!DP39,\"\")","v":""},null,null,null,{"$f":"IF(DT$2=1,Klimadaten!DT39,\"\")","v":""},null,null,null,{"$f":"IF(DX$2=1,Klimadaten!DX39,\"\")","v":""},null,null,null,{"$f":"IF(EB$2=1,Klimadaten!EB39,\"\")","v":""},null,null,null,{"$f":"IF(EF$2=1,Klimadaten!EF39,\"\")","v":""},null,null,null,{"$f":"IF(EJ$2=1,Klimadaten!EJ39,\"\")","v":""},null,null,null,{"$f":"IF(EN$2=1,Klimadaten!EN39,\"\")","v":""},null,null,null,{"$f":"IF(ER$2=1,Klimadaten!ER39,\"\")","v":""},null,null,null,{"$f":"IF(EV$2=1,Klimadaten!EV39,\"\")","v":""},null,null,null,{"$f":"IF(EZ$2=1,Klimadaten!EZ39,\"\")","v":""},null,null,null,{"$f":"IF(FD$2=1,Klimadaten!FD39,\"\")","v":""},null,null,null,{"$f":"IF(FH$2=1,Klimadaten!FH39,\"\")","v":""},null,null,null,{"$f":"IF(FL$2=1,Klimadaten!FL39,\"\")","v":""},null,null,null,{"$f":"IF(FP$2=1,Klimadaten!FP39,\"\")","v":""},null,null,null,{"$f":"IF(FT$2=1,Klimadaten!FT39,\"\")","v":""},null,null,null,{"$f":"IF(FX$2=1,Klimadaten!FX39,\"\")","v":""},null,null,null,{"$f":"IF(GB$2=1,Klimadaten!GB39,\"\")","v":""},null,null,null,{"$f":"IF(GF$2=1,Klimadaten!GF39,\"\")","v":""},null,null,null,{"$f":"IF(GJ$2=1,Klimadaten!GJ39,\"\")","v":""},null,null,null,{"$f":"IF(GN$2=1,Klimadaten!GN39,\"\")","v":""},null,null,null,{"$f":"IF(GR$2=1,Klimadaten!GR39,\"\")","v":""},null,null,null,{"$f":"IF(GV$2=1,Klimadaten!GV39,\"\")","v":""},null,null,null,{"$f":"IF(GZ$2=1,Klimadaten!GZ39,\"\")","v":""},null,null,null,{"$f":"IF(HD$2=1,Klimadaten!HD39,\"\")","v":""},null,null,null,{"$f":"IF(HH$2=1,Klimadaten!HH39,\"\")","v":""},null,null,null,{"$f":"IF(HL$2=1,Klimadaten!HL39,\"\")","v":15},null,null,null,null,null,null,null,null,null,null,null,null,null,null,null,null,null,null,null,{"$f":"IF(IF$2=1,Klimadaten!IF39,\"\")","v":""},null,null,null,{"$f":"IF(IJ$2=1,Klimadaten!IJ39,\"\")","v":""},null,null,null,{"$f":"IF(IN$2=1,Klimadaten!IN39,\"\")","v":""},null,null,null,{"$f":"IF(IR$2=1,Klimadaten!IR39,\"\")","v":""},null,null,null,{"$f":"IF(IV$2=1,Klimadaten!IV39,\"\")","v":""}]
[10,null,null,{"$f":"IF(D$2=1,Klimadaten!D40,\"\")","v":""},null,null,null,{"$f":"IF(H$2=1,Klimadaten!H40,\"\")","v":13},null,null,null,{"$f":"IF(L$2=1,Klimadaten!L40,\"\")","v":15},null,null,null,{"$f":"IF(P$2=1,Klimadaten!P40,\"\")","v":""},null,null,null,{"$f":"IF(T$2=1,Klimadaten!T40,\"\")","v":""},null,null,null,{"$f":"IF(X$2=1,Klimadaten!X40,\"\")","v":""},null,null,null,{"$f":"IF(AB$2=1,Klimadaten!AB40,\"\")","v":""},null,null,null,{"$f":"IF(AF$2=1,Klimadaten!AF40,\"\")","v":""},null,null,null,{"$f":"IF(AJ$2=1,Klimadaten!AJ40,\"\")","v":""},null,null,null,{"$f":"IF(AN$2=1,Klimadaten!AN40,\"\")","v":""},null,null,null,{"$f":"IF(AR$2=1,Klimadaten!AR40,\"\")","v":""},null,null,null,{"$f":"IF(AV$2=1,Klimadaten!AV40,\"\")","v":""},null,null,null,{"$f":"IF(AZ$2=1,Klimadaten!AZ40,\"\")","v":""},null,null,null,{"$f":"IF(BD$2=1,Klimadaten!BD40,\"\")","v":""},null,null,null,{"$f":"IF(BH$2=1,Klimadaten!BH40,\"\")","v":""},null,null,null,{"$f":"IF(BL$2=1,Klimadaten!BL40,\"\")","v":""},null,null,null,{"$f":"IF(BP$2=1,Klimadaten!BP40,\"\")","v":""},null,null,null,{"$f":"IF(BT$2=1,Klimadaten!BT40,\"\")","v":""},null,null,null,{"$f":"IF(BX$2=1,Klimadaten!BX40,\"\")","v":""},null,null,null,{"$f":"IF(CB$2=1,Klimadaten!CB40,\"\")","v":""},null,null,null,{"$f":"IF(CF$2=1,Klimadaten!CF40,\"\")","v":""},null,null,null,{"$f":"IF(CJ$2=1,Klimadaten!CJ40,\"\")","v":""},null,null,null,{"$f":"IF(CN$2=1,Klimadaten!CN40,\"\")","v":""},null,null,null,{"$f":"IF(CR$2=1,Klimadaten!CR40,\"\")","v":16},null,null,null,{"$f":"IF(CV$2=1,Klimadaten!CV40,\"\")","v":""},null,null,null,{"$f":"IF(CZ$2=1,Klimadaten!CZ40,\"\")","v":""},null,null,null,{"$f":"IF(DD$2=1,Klimadaten!DD40,\"\")","v":""},null,null,null,{"$f":"IF(DH$2=1,Klimadaten!DH40,\"\")","v":""},null,null,null,{"$f":"IF(DL$2=1,Klimadaten!DL40,\"\")","v":""},null,null,null,{"$f":"IF(DP$2=1,Klimadaten!DP40,\"\")","v":""},null,null,null,{"$f":"IF(DT$2=1,Klimadaten!DT40,\"\")","v":""},null,null,null,{"$f":"IF(DX$2=1,Klimadaten!DX40,\"\")","v":""},null,null,null,{"$f":"IF(EB$2=1,Klimadaten!EB40,\"\")","v":""},null,null,null,{"$f":"IF(EF$2=1,Klimadaten!EF40,\"\")","v":""},null,null,null,{"$f":"IF(EJ$2=1,Klimadaten!EJ40,\"\")","v":""},null,null,null,{"$f":"IF(EN$2=1,Klimadaten!EN40,\"\")","v":""},null,null,null,{"$f":"IF(ER$2=1,Klimadaten!ER40,\"\")","v":""},null,null,null,{"$f":"IF(EV$2=1,Klimadaten!EV40,\"\")","v":""},null,null,null,{"$f":"IF(EZ$2=1,Klimadaten!EZ40,\"\")","v":""},null,null,null,{"$f":"IF(FD$2=1,Klimadaten!FD40,\"\")","v":""},null,null,null,{"$f":"IF(FH$2=1,Klimadaten!FH40,\"\")","v":""},null,null,null,{"$f":"IF(FL$2=1,Klimadaten!FL40,\"\")","v":""},null,null,null,{"$f":"IF(FP$2=1,Klimadaten!FP40,\"\")","v":""},null,null,null,{"$f":"IF(FT$2=1,Klimadaten!FT40,\"\")","v":""},null,null,null,{"$f":"IF(FX$2=1,Klimadaten!FX40,\"\")","v":""},null,null,null,{"$f":"IF(GB$2=1,Klimadaten!GB40,\"\")","v":""},null,null,null,{"$f":"IF(GF$2=1,Klimadaten!GF40,\"\")","v":""},null,null,null,{"$f":"IF(GJ$2=1,Klimadaten!GJ40,\"\")","v":""},null,null,null,{"$f":"IF(GN$2=1,Klimadaten!GN40,\"\")","v":""},null,null,null,{"$f":"IF(GR$2=1,Klimadaten!GR40,\"\")","v":""},null,null,null,{"$f":"IF(GV$2=1,Klimadaten!GV40,\"\")","v":""},null,null,null,{"$f":"IF(GZ$2=1,Klimadaten!GZ40,\"\")","v":""},null,null,null,{"$f":"IF(HD$2=1,Klimadaten!HD40,\"\")","v":""},null,null,null,{"$f":"IF(HH$2=1,Klimadaten!HH40,\"\")","v":""},null,null,null,{"$f":"IF(HL$2=1,Klimadaten!HL40,\"\")","v":16},null,null,null,null,null,null,null,null,null,null,null,null,null,null,null,null,null,null,null,{"$f":"IF(IF$2=1,Klimadaten!IF40,\"\")","v":""},null,null,null,{"$f":"IF(IJ$2=1,Klimadaten!IJ40,\"\")","v":""},null,null,null,{"$f":"IF(IN$2=1,Klimadaten!IN40,\"\")","v":""},null,null,null,{"$f":"IF(IR$2=1,Klimadaten!IR40,\"\")","v":""},null,null,null,{"$f":"IF(IV$2=1,Klimadaten!IV40,\"\")","v":""}]
[11,null,null,{"$f":"IF(D$2=1,Klimadaten!D41,\"\")","v":""},null,null,null,{"$f":"IF(H$2=1,Klimadaten!H41,\"\")","v":13},null,null,null,{"$f":"IF(L$2=1,Klimadaten!L41,\"\")","v":14},null,null,null,{"$f":"IF(P$2=1,Klimadaten!P41,\"\")","v":""},null,null,null,{"$f":"IF(T$2=1,Klimadaten!T41,\"\")","v":""},null,null,null,{"$f":"IF(X$2=1,Klimadaten!X41,\"\")","v":""},null,null,null,{"$f":"IF(AB$2=1,Klimadaten!AB41,\"\")","v":""},null,null,null,{"$f":"IF(AF$2=1,Klimadaten!AF41,\"\")","v":""},null,null,null,{"$f":"IF(AJ$2=1,Klimadaten!AJ41,\"\")","v":""},null,null,null,{"$f":"IF(AN$2=1,Klimadaten!AN41,\"\")","v":""},null,null,null,{"$f":"IF(AR$2=1,Klimadaten!AR41,\"\")","v":""},null,null,null,{"$f":"IF(AV$2=1,Klimadaten!AV41,\"\")","v":""},null,null,null,{"$f":"IF(AZ$2=1,Klimadaten!AZ41,\"\")","v":""},null,null,null,{"$f":"IF(BD$2=1,Klimadaten!BD41,\"\")","v":""},null,null,null,{"$f":"IF(BH$2=1,Klimadaten!BH41,\"\")","v":""},null,null,null,{"$f":"IF(BL$2=1,Klimadaten!BL41,\"\")","v":""},null,null,null,{"$f":"IF(BP$2=1,Klimadaten!BP41,\"\")","v":""},null,null,null,{"$f":"IF(BT$2=1,Klimadaten!BT41,\"\")","v":""},null,null,null,{"$f":"IF(BX$2=1,Klimadaten!BX41,\"\")","v":""},null,null,null,{"$f":"IF(CB$2=1,Klimadaten!CB41,\"\")","v":""},null,null,null,{"$f":"IF(CF$2=1,Klimadaten!CF41,\"\")","v":""},null,null,null,{"$f":"IF(CJ$2=1,Klimadaten!CJ41,\"\")","v":""},null,null,null,{"$f":"IF(CN$2=1,Klimadaten!CN41,\"\")","v":""},null,null,null,{"$f":"IF(CR$2=1,Klimadaten!CR41,\"\")","v":18},null,null,null,{"$f":"IF(CV$2=1,Klimadaten!CV41,\"\")","v":""},null,null,null,{"$f":"IF(CZ$2=1,Klimadaten!CZ41,\"\")","v":""},null,null,null,{"$f":"IF(DD$2=1,Klimadaten!DD41,\"\")","v":""},null,null,null,{"$f":"IF(DH$2=1,Klimadaten!DH41,\"\")","v":""},null,null,null,{"$f":"IF(DL$2=1,Klimadaten!DL41,\"\")","v":""},null,null,null,{"$f":"IF(DP$2=1,Klimadaten!DP41,\"\")","v":""},null,null,null,{"$f":"IF(DT$2=1,Klimadaten!DT41,\"\")","v":""},null,null,null,{"$f":"IF(DX$2=1,Klimadaten!DX41,\"\")","v":""},null,null,null,{"$f":"IF(EB$2=1,Klimadaten!EB41,\"\")","v":""},null,null,null,{"$f":"IF(EF$2=1,Klimadaten!EF41,\"\")","v":""},null,null,null,{"$f":"IF(EJ$2=1,Klimadaten!EJ41,\"\")","v":""},null,null,null,{"$f":"IF(EN$2=1,Klimadaten!EN41,\"\")","v":""},null,null,null,{"$f":"IF(ER$2=1,Klimadaten!ER41,\"\")","v":""},null,null,null,{"$f":"IF(EV$2=1,Klimadaten!EV41,\"\")","v":""},null,null,null,{"$f":"IF(EZ$2=1,Klimadaten!EZ41,\"\")","v":""},null,null,null,{"$f":"IF(FD$2=1,Klimadaten!FD41,\"\")","v":""},null,null,null,{"$f":"IF(FH$2=1,Klimadaten!FH41,\"\")","v":""},null,null,null,{"$f":"IF(FL$2=1,Klimadaten!FL41,\"\")","v":""},null,null,null,{"$f":"IF(FP$2=1,Klimadaten!FP41,\"\")","v":""},null,null,null,{"$f":"IF(FT$2=1,Klimadaten!FT41,\"\")","v":""},null,null,null,{"$f":"IF(FX$2=1,Klimadaten!FX41,\"\")","v":""},null,null,null,{"$f":"IF(GB$2=1,Klimadaten!GB41,\"\")","v":""},null,null,null,{"$f":"IF(GF$2=1,Klimadaten!GF41,\"\")","v":""},null,null,null,{"$f":"IF(GJ$2=1,Klimadaten!GJ41,\"\")","v":""},null,null,null,{"$f":"IF(GN$2=1,Klimadaten!GN41,\"\")","v":""},null,null,null,{"$f":"IF(GR$2=1,Klimadaten!GR41,\"\")","v":""},null,null,null,{"$f":"IF(GV$2=1,Klimadaten!GV41,\"\")","v":""},null,null,null,{"$f":"IF(GZ$2=1,Klimadaten!GZ41,\"\")","v":""},null,null,null,{"$f":"IF(HD$2=1,Klimadaten!HD41,\"\")","v":""},null,null,null,{"$f":"IF(HH$2=1,Klimadaten!HH41,\"\")","v":""},null,null,null,{"$f":"IF(HL$2=1,Klimadaten!HL41,\"\")","v":18},null,null,null,null,null,null,null,null,null,null,null,null,null,null,null,null,null,null,null,{"$f":"IF(IF$2=1,Klimadaten!IF41,\"\")","v":""},null,null,null,{"$f":"IF(IJ$2=1,Klimadaten!IJ41,\"\")","v":""},null,null,null,{"$f":"IF(IN$2=1,Klimadaten!IN41,\"\")","v":""},null,null,null,{"$f":"IF(IR$2=1,Klimadaten!IR41,\"\")","v":""},null,null,null,{"$f":"IF(IV$2=1,Klimadaten!IV41,\"\")","v":""}]
[12,null,null,{"$f":"IF(D$2=1,Klimadaten!D42,\"\")","v":""},null,null,null,{"$f":"IF(H$2=1,Klimadaten!H42,\"\")","v":17},null,null,null,{"$f":"IF(L$2=1,Klimadaten!L42,\"\")","v":13},null,null,null,{"$f":"IF(P$2=1,Klimadaten!P42,\"\")","v":""},null,null,null,{"$f":"IF(T$2=1,Klimadaten!T42,\"\")","v":""},null,null,null,{"$f":"IF(X$2=1,Klimadaten!X42,\"\")","v":""},null,null,null,{"$f":"IF(AB$2=1,Klimadaten!AB42,\"\")","v":""},null,null,null,{"$f":"IF(AF$2=1,Klimadaten!AF42,\"\")","v":""},null,null,null,{"$f":"IF(AJ$2=1,Klimadaten!AJ42,\"\")","v":""},null,null,null,{"$f":"IF(AN$2=1,Klimadaten!AN42,\"\")","v":""},null,null,null,{"$f":"IF(AR$2=1,Klimadaten!AR42,\"\")","v":""},null,null,null,{"$f":"IF(AV$2=1,Klimadaten!AV42,\"\")","v":""},null,null,null,{"$f":"IF(AZ$2=1,Klimadaten!AZ42,\"\")","v":""},null,null,null,{"$f":"IF(BD$2=1,Klimadaten!BD42,\"\")","v":""},null,null,null,{"$f":"IF(BH$2=1,Klimadaten!BH42,\"\")","v":""},null,null,null,{"$f":"IF(BL$2=1,Klimadaten!BL42,\"\")","v":""},null,null,null,{"$f":"IF(BP$2=1,Klimadaten!BP42,\"\")","v":""},null,null,null,{"$f":"IF(BT$2=1,Klimadaten!BT42,\"\")","v":""},null,null,null,{"$f":"IF(BX$2=1,Klimadaten!BX42,\"\")","v":""},null,null,null,{"$f":"IF(CB$2=1,Klimadaten!CB42,\"\")","v":""},null,null,null,{"$f":"IF(CF$2=1,Klimadaten!CF42,\"\")","v":""},null,null,null,{"$f":"IF(CJ$2=1,Klimadaten!CJ42,\"\")","v":""},null,null,null,{"$f":"IF(CN$2=1,Klimadaten!CN42,\"\")","v":""},null,null,null,{"$f":"IF(CR$2=1,Klimadaten!CR42,\"\")","v":17},null,null,null,{"$f":"IF(CV$2=1,Klimadaten!CV42,\"\")","v":""},null,null,null,{"$f":"IF(CZ$2=1,Klimadaten!CZ42,\"\")","v":""},null,null,null,{"$f":"IF(DD$2=1,Klimadaten!DD42,\"\")","v":""},null,null,null,{"$f":"IF(DH$2=1,Klimadaten!DH42,\"\")","v":""},null,null,null,{"$f":"IF(DL$2=1,Klimadaten!DL42,\"\")","v":""},null,null,null,{"$f":"IF(DP$2=1,Klimadaten!DP42,\"\")","v":""},null,null,null,{"$f":"IF(DT$2=1,Klimadaten!DT42,\"\")","v":""},null,null,null,{"$f":"IF(DX$2=1,Klimadaten!DX42,\"\")","v":""},null,null,null,{"$f":"IF(EB$2=1,Klimadaten!EB42,\"\")","v":""},null,null,null,{"$f":"IF(EF$2=1,Klimadaten!EF42,\"\")","v":""},null,null,null,{"$f":"IF(EJ$2=1,Klimadaten!EJ42,\"\")","v":""},null,null,null,{"$f":"IF(EN$2=1,Klimadaten!EN42,\"\")","v":""},null,null,null,{"$f":"IF(ER$2=1,Klimadaten!ER42,\"\")","v":""},null,null,null,{"$f":"IF(EV$2=1,Klimadaten!EV42,\"\")","v":""},null,null,null,{"$f":"IF(EZ$2=1,Klimadaten!EZ42,\"\")","v":""},null,null,null,{"$f":"IF(FD$2=1,Klimadaten!FD42,\"\")","v":""},null,null,null,{"$f":"IF(FH$2=1,Klimadaten!FH42,\"\")","v":""},null,null,null,{"$f":"IF(FL$2=1,Klimadaten!FL42,\"\")","v":""},null,null,null,{"$f":"IF(FP$2=1,Klimadaten!FP42,\"\")","v":""},null,null,null,{"$f":"IF(FT$2=1,Klimadaten!FT42,\"\")","v":""},null,null,null,{"$f":"IF(FX$2=1,Klimadaten!FX42,\"\")","v":""},null,null,null,{"$f":"IF(GB$2=1,Klimadaten!GB42,\"\")","v":""},null,null,null,{"$f":"IF(GF$2=1,Klimadaten!GF42,\"\")","v":""},null,null,null,{"$f":"IF(GJ$2=1,Klimadaten!GJ42,\"\")","v":""},null,null,null,{"$f":"IF(GN$2=1,Klimadaten!GN42,\"\")","v":""},null,null,null,{"$f":"IF(GR$2=1,Klimadaten!GR42,\"\")","v":""},null,null,null,{"$f":"IF(GV$2=1,Klimadaten!GV42,\"\")","v":""},null,null,null,{"$f":"IF(GZ$2=1,Klimadaten!GZ42,\"\")","v":""},null,null,null,{"$f":"IF(HD$2=1,Klimadaten!HD42,\"\")","v":""},null,null,null,{"$f":"IF(HH$2=1,Klimadaten!HH42,\"\")","v":""},null,null,null,{"$f":"IF(HL$2=1,Klimadaten!HL42,\"\")","v":14},null,null,null,null,null,null,null,null,null,null,null,null,null,null,null,null,null,null,null,{"$f":"IF(IF$2=1,Klimadaten!IF42,\"\")","v":""},null,null,null,{"$f":"IF(IJ$2=1,Klimadaten!IJ42,\"\")","v":""},null,null,null,{"$f":"IF(IN$2=1,Klimadaten!IN42,\"\")","v":""},null,null,null,{"$f":"IF(IR$2=1,Klimadaten!IR42,\"\")","v":""},null,null,null,{"$f":"IF(IV$2=1,Klimadaten!IV42,\"\")","v":""}]
[13,null,null,{"$f":"IF(D$2=1,Klimadaten!D43,\"\")","v":""},null,null,null,{"$f":"IF(H$2=1,Klimadaten!H43,\"\")","v":17},null,null,null,{"$f":"IF(L$2=1,Klimadaten!L43,\"\")","v":14},null,null,null,{"$f":"IF(P$2=1,Klimadaten!P43,\"\")","v":""},null,null,null,{"$f":"IF(T$2=1,Klimadaten!T43,\"\")","v":""},null,null,null,{"$f":"IF(X$2=1,Klimadaten!X43,\"\")","v":""},null,null,null,{"$f":"IF(AB$2=1,Klimadaten!AB43,\"\")","v":""},null,null,null,{"$f":"IF(AF$2=1,Klimadaten!AF43,\"\")","v":""},null,null,null,{"$f":"IF(AJ$2=1,Klimadaten!AJ43,\"\")","v":""},null,null,null,{"$f":"IF(AN$2=1,Klimadaten!AN43,\"\")","v":""},null,null,null,{"$f":"IF(AR$2=1,Klimadaten!AR43,\"\")","v":""},null,null,null,{"$f":"IF(AV$2=1,Klimadaten!AV43,\"\")","v":""},null,null,null,{"$f":"IF(AZ$2=1,Klimadaten!AZ43,\"\")","v":""},null,null,null,{"$f":"IF(BD$2=1,Klimadaten!BD43,\"\")","v":""},null,null,null,{"$f":"IF(BH$2=1,Klimadaten!BH43,\"\")","v":""},null,null,null,{"$f":"IF(BL$2=1,Klimadaten!BL43,\"\")","v":""},null,null,null,{"$f":"IF(BP$2=1,Klimadaten!BP43,\"\")","v":""},null,null,null,{"$f":"IF(BT$2=1,Klimadaten!BT43,\"\")","v":""},null,null,null,{"$f":"IF(BX$2=1,Klimadaten!BX43,\"\")","v":""},null,null,null,{"$f":"IF(CB$2=1,Klimadaten!CB43,\"\")","v":""},null,null,null,{"$f":"IF(CF$2=1,Klimadaten!CF43,\"\")","v":""},null,null,null,{"$f":"IF(CJ$2=1,Klimadaten!CJ43,\"\")","v":""},null,null,null,{"$f":"IF(CN$2=1,Klimadaten!CN43,\"\")","v":""},null,null,null,{"$f":"IF(CR$2=1,Klimadaten!CR43,\"\")","v":17},null,null,null,{"$f":"IF(CV$2=1,Klimadaten!CV43,\"\")","v":""},null,null,null,{"$f":"IF(CZ$2=1,Klimadaten!CZ43,\"\")","v":""},null,null,null,{"$f":"IF(DD$2=1,Klimadaten!DD43,\"\")","v":""},null,null,null,{"$f":"IF(DH$2=1,Klimadaten!DH43,\"\")","v":""},null,null,null,{"$f":"IF(DL$2=1,Klimadaten!DL43,\"\")","v":""},null,null,null,{"$f":"IF(DP$2=1,Klimadaten!DP43,\"\")","v":""},null,null,null,{"$f":"IF(DT$2=1,Klimadaten!DT43,\"\")","v":""},null,null,null,{"$f":"IF(DX$2=1,Klimadaten!DX43,\"\")","v":""},null,null,null,{"$f":"IF(EB$2=1,Klimadaten!EB43,\"\")","v":""},null,null,null,{"$f":"IF(EF$2=1,Klimadaten!EF43,\"\")","v":""},null,null,null,{"$f":"IF(EJ$2=1,Klimadaten!EJ43,\"\")","v":""},null,null,null,{"$f":"IF(EN$2=1,Klimadaten!EN43,\"\")","v":""},null,null,null,{"$f":"IF(ER$2=1,Klimadaten!ER43,\"\")","v":""},null,null,null,{"$f":"IF(EV$2=1,Klimadaten!EV43,\"\")","v":""},null,null,null,{"$f":"IF(EZ$2=1,Klimadaten!EZ43,\"\")","v":""},null,null,null,{"$f":"IF(FD$2=1,Klimadaten!FD43,\"\")","v":""},null,null,null,{"$f":"IF(FH$2=1,Klimadaten!FH43,\"\")","v":""},null,null,null,{"$f":"IF(FL$2=1,Klimadaten!FL43,\"\")","v":""},null,null,null,{"$f":"IF(FP$2=1,Klimadaten!FP43,\"\")","v":""},null,null,null,{"$f":"IF(FT$2=1,Klimadaten!FT43,\"\")","v":""},null,null,null,{"$f":"IF(FX$2=1,Klimadaten!FX43,\"\")","v":""},null,null,null,{"$f":"IF(GB$2=1,Klimadaten!GB43,\"\")","v":""},null,null,null,{"$f":"IF(GF$2=1,Klimadaten!GF43,\"\")","v":""},null,null,null,{"$f":"IF(GJ$2=1,Klimadaten!GJ43,\"\")","v":""},null,null,null,{"$f":"IF(GN$2=1,Klimadaten!GN43,\"\")","v":""},null,null,null,{"$f":"IF(GR$2=1,Klimadaten!GR43,\"\")","v":""},null,null,null,{"$f":"IF(GV$2=1,Klimadaten!GV43,\"\")","v":""},null,null,null,{"$f":"IF(GZ$2=1,Klimadaten!GZ43,\"\")","v":""},null,null,null,{"$f":"IF(HD$2=1,Klimadaten!HD43,\"\")","v":""},null,null,null,{"$f":"IF(HH$2=1,Klimadaten!HH43,\"\")","v":""},null,null,null,{"$f":"IF(HL$2=1,Klimadaten!HL43,\"\")","v":16},null,null,null,null,null,null,null,null,null,null,null,null,null,null,null,null,null,null,null,{"$f":"IF(IF$2=1,Klimadaten!IF43,\"\")","v":""},null,null,null,{"$f":"IF(IJ$2=1,Klimadaten!IJ43,\"\")","v":""},null,null,null,{"$f":"IF(IN$2=1,Klimadaten!IN43,\"\")","v":""},null,null,null,{"$f":"IF(IR$2=1,Klimadaten!IR43,\"\")","v":""},null,null,null,{"$f":"IF(IV$2=1,Klimadaten!IV43,\"\")","v":""}]
[14,null,null,{"$f":"IF(D$2=1,Klimadaten!D44,\"\")","v":""},null,null,null,{"$f":"IF(H$2=1,Klimadaten!H44,\"\")","v":16},null,null,null,{"$f":"IF(L$2=1,Klimadaten!L44,\"\")","v":14},null,null,null,{"$f":"IF(P$2=1,Klimadaten!P44,\"\")","v":""},null,null,null,{"$f":"IF(T$2=1,Klimadaten!T44,\"\")","v":""},null,null,null,{"$f":"IF(X$2=1,Klimadaten!X44,\"\")","v":""},null,null,null,{"$f":"IF(AB$2=1,Klimadaten!AB44,\"\")","v":""},null,null,null,{"$f":"IF(AF$2=1,Klimadaten!AF44,\"\")","v":""},null,null,null,{"$f":"IF(AJ$2=1,Klimadaten!AJ44,\"\")","v":""},null,null,null,{"$f":"IF(AN$2=1,Klimadaten!AN44,\"\")","v":""},null,null,null,{"$f":"IF(AR$2=1,Klimadaten!AR44,\"\")","v":""},null,null,null,{"$f":"IF(AV$2=1,Klimadaten!AV44,\"\")","v":""},null,null,null,{"$f":"IF(AZ$2=1,Klimadaten!AZ44,\"\")","v":""},null,null,null,{"$f":"IF(BD$2=1,Klimadaten!BD44,\"\")","v":""},null,null,null,{"$f":"IF(BH$2=1,Klimadaten!BH44,\"\")","v":""},null,null,null,{"$f":"IF(BL$2=1,Klimadaten!BL44,\"\")","v":""},null,null,null,{"$f":"IF(BP$2=1,Klimadaten!BP44,\"\")","v":""},null,null,null,{"$f":"IF(BT$2=1,Klimadaten!BT44,\"\")","v":""},null,null,null,{"$f":"IF(BX$2=1,Klimadaten!BX44,\"\")","v":""},null,null,null,{"$f":"IF(CB$2=1,Klimadaten!CB44,\"\")","v":""},null,null,null,{"$f":"IF(CF$2=1,Klimadaten!CF44,\"\")","v":""},null,null,null,{"$f":"IF(CJ$2=1,Klimadaten!CJ44,\"\")","v":""},null,null,null,{"$f":"IF(CN$2=1,Klimadaten!CN44,\"\")","v":""},null,null,null,{"$f":"IF(CR$2=1,Klimadaten!CR44,\"\")","v":17},null,null,null,{"$f":"IF(CV$2=1,Klimadaten!CV44,\"\")","v":""},null,null,null,{"$f":"IF(CZ$2=1,Klimadaten!CZ44,\"\")","v":""},null,null,null,{"$f":"IF(DD$2=1,Klimadaten!DD44,\"\")","v":""},null,null,null,{"$f":"IF(DH$2=1,Klimadaten!DH44,\"\")","v":""},null,null,null,{"$f":"IF(DL$2=1,Klimadaten!DL44,\"\")","v":""},null,null,null,{"$f":"IF(DP$2=1,Klimadaten!DP44,\"\")","v":""},null,null,null,{"$f":"IF(DT$2=1,Klimadaten!DT44,\"\")","v":""},null,null,null,{"$f":"IF(DX$2=1,Klimadaten!DX44,\"\")","v":""},null,null,null,{"$f":"IF(EB$2=1,Klimadaten!EB44,\"\")","v":""},null,null,null,{"$f":"IF(EF$2=1,Klimadaten!EF44,\"\")","v":""},null,null,null,{"$f":"IF(EJ$2=1,Klimadaten!EJ44,\"\")","v":""},null,null,null,{"$f":"IF(EN$2=1,Klimadaten!EN44,\"\")","v":""},null,null,null,{"$f":"IF(ER$2=1,Klimadaten!ER44,\"\")","v":""},null,null,null,{"$f":"IF(EV$2=1,Klimadaten!EV44,\"\")","v":""},null,null,null,{"$f":"IF(EZ$2=1,Klimadaten!EZ44,\"\")","v":""},null,null,null,{"$f":"IF(FD$2=1,Klimadaten!FD44,\"\")","v":""},null,null,null,{"$f":"IF(FH$2=1,Klimadaten!FH44,\"\")","v":""},null,null,null,{"$f":"IF(FL$2=1,Klimadaten!FL44,\"\")","v":""},null,null,null,{"$f":"IF(FP$2=1,Klimadaten!FP44,\"\")","v":""},null,null,null,{"$f":"IF(FT$2=1,Klimadaten!FT44,\"\")","v":""},null,null,null,{"$f":"IF(FX$2=1,Klimadaten!FX44,\"\")","v":""},null,null,null,{"$f":"IF(GB$2=1,Klimadaten!GB44,\"\")","v":""},null,null,null,{"$f":"IF(GF$2=1,Klimadaten!GF44,\"\")","v":""},null,null,null,{"$f":"IF(GJ$2=1,Klimadaten!GJ44,\"\")","v":""},null,null,null,{"$f":"IF(GN$2=1,Klimadaten!GN44,\"\")","v":""},null,null,null,{"$f":"IF(GR$2=1,Klimadaten!GR44,\"\")","v":""},null,null,null,{"$f":"IF(GV$2=1,Klimadaten!GV44,\"\")","v":""},null,null,null,{"$f":"IF(GZ$2=1,Klimadaten!GZ44,\"\")","v":""},null,null,null,{"$f":"IF(HD$2=1,Klimadaten!HD44,\"\")","v":""},null,null,null,{"$f":"IF(HH$2=1,Klimadaten!HH44,\"\")","v":""},null,null,null,{"$f":"IF(HL$2=1,Klimadaten!HL44,\"\")","v":13},null,null,null,null,null,null,null,null,null,null,null,null,null,null,null,null,null,null,null,{"$f":"IF(IF$2=1,Klimadaten!IF44,\"\")","v":""},null,null,null,{"$f":"IF(IJ$2=1,Klimadaten!IJ44,\"\")","v":""},null,null,null,{"$f":"IF(IN$2=1,Klimadaten!IN44,\"\")","v":""},null,null,null,{"$f":"IF(IR$2=1,Klimadaten!IR44,\"\")","v":""},null,null,null,{"$f":"IF(IV$2=1,Klimadaten!IV44,\"\")","v":""}]
[15,null,null,{"$f":"IF(D$2=1,Klimadaten!D45,\"\")","v":""},null,null,null,{"$f":"IF(H$2=1,Klimadaten!H45,\"\")","v":16},null,null,null,{"$f":"IF(L$2=1,Klimadaten!L45,\"\")","v":11},null,null,null,{"$f":"IF(P$2=1,Klimadaten!P45,\"\")","v":""},null,null,null,{"$f":"IF(T$2=1,Klimadaten!T45,\"\")","v":""},null,null,null,{"$f":"IF(X$2=1,Klimadaten!X45,\"\")","v":""},null,null,null,{"$f":"IF(AB$2=1,Klimadaten!AB45,\"\")","v":""},null,null,null,{"$f":"IF(AF$2=1,Klimadaten!AF45,\"\")","v":""},null,null,null,{"$f":"IF(AJ$2=1,Klimadaten!AJ45,\"\")","v":""},null,null,null,{"$f":"IF(AN$2=1,Klimadaten!AN45,\"\")","v":""},null,null,null,{"$f":"IF(AR$2=1,Klimadaten!AR45,\"\")","v":""},null,null,null,{"$f":"IF(AV$2=1,Klimadaten!AV45,\"\")","v":""},null,null,null,{"$f":"IF(AZ$2=1,Klimadaten!AZ45,\"\")","v":""},null,null,null,{"$f":"IF(BD$2=1,Klimadaten!BD45,\"\")","v":""},null,null,null,{"$f":"IF(BH$2=1,Klimadaten!BH45,\"\")","v":""},null,null,null,{"$f":"IF(BL$2=1,Klimadaten!BL45,\"\")","v":""},null,null,null,{"$f":"IF(BP$2=1,Klimadaten!BP45,\"\")","v":""},null,null,null,{"$f":"IF(BT$2=1,Klimadaten!BT45,\"\")","v":""},null,null,null,{"$f":"IF(BX$2=1,Klimadaten!BX45,\"\")","v":""},null,null,null,{"$f":"IF(CB$2=1,Klimadaten!CB45,\"\")","v":""},null,null,null,{"$f":"IF(CF$2=1,Klimadaten!CF45,\"\")","v":""},null,null,null,{"$f":"IF(CJ$2=1,Klimadaten!CJ45,\"\")","v":""},null,null,null,{"$f":"IF(CN$2=1,Klimadaten!CN45,\"\")","v":""},null,null,null,{"$f":"IF(CR$2=1,Klimadaten!CR45,\"\")","v":15},null,null,null,{"$f":"IF(CV$2=1,Klimadaten!CV45,\"\")","v":""},null,null,null,{"$f":"IF(CZ$2=1,Klimadaten!CZ45,\"\")","v":""},null,null,null,{"$f":"IF(DD$2=1,Klimadaten!DD45,\"\")","v":""},null,null,null,{"$f":"IF(DH$2=1,Klimadaten!DH45,\"\")","v":""},null,null,null,{"$f":"IF(DL$2=1,Klimadaten!DL45,\"\")","v":""},null,null,null,{"$f":"IF(DP$2=1,Klimadaten!DP45,\"\")","v":""},null,null,null,{"$f":"IF(DT$2=1,Klimadaten!DT45,\"\")","v":""},null,null,null,{"$f":"IF(DX$2=1,Klimadaten!DX45,\"\")","v":""},null,null,null,{"$f":"IF(EB$2=1,Klimadaten!EB45,\"\")","v":""},null,null,null,{"$f":"IF(EF$2=1,Klimadaten!EF45,\"\")","v":""},null,null,null,{"$f":"IF(EJ$2=1,Klimadaten!EJ45,\"\")","v":""},null,null,null,{"$f":"IF(EN$2=1,Klimadaten!EN45,\"\")","v":""},null,null,null,{"$f":"IF(ER$2=1,Klimadaten!ER45,\"\")","v":""},null,null,null,{"$f":"IF(EV$2=1,Klimadaten!EV45,\"\")","v":""},null,null,null,{"$f":"IF(EZ$2=1,Klimadaten!EZ45,\"\")","v":""},null,null,null,{"$f":"IF(FD$2=1,Klimadaten!FD45,\"\")","v":""},null,null,null,{"$f":"IF(FH$2=1,Klimadaten!FH45,\"\")","v":""},null,null,null,{"$f":"IF(FL$2=1,Klimadaten!FL45,\"\")","v":""},null,null,null,{"$f":"IF(FP$2=1,Klimadaten!FP45,\"\")","v":""},null,null,null,{"$f":"IF(FT$2=1,Klimadaten!FT45,\"\")","v":""},null,null,null,{"$f":"IF(FX$2=1,Klimadaten!FX45,\"\")","v":""},null,null,null,{"$f":"IF(GB$2=1,Klimadaten!GB45,\"\")","v":""},null,null,null,{"$f":"IF(GF$2=1,Klimadaten!GF45,\"\")","v":""},null,null,null,{"$f":"IF(GJ$2=1,Klimadaten!GJ45,\"\")","v":""},null,null,null,{"$f":"IF(GN$2=1,Klimadaten!GN45,\"\")","v":""},null,null,null,{"$f":"IF(GR$2=1,Klimadaten!GR45,\"\")","v":""},null,null,null,{"$f":"IF(GV$2=1,Klimadaten!GV45,\"\")","v":""},null,null,null,{"$f":"IF(GZ$2=1,Klimadaten!GZ45,\"\")","v":""},null,null,null,{"$f":"IF(HD$2=1,Klimadaten!HD45,\"\")","v":""},null,null,null,{"$f":"IF(HH$2=1,Klimadaten!HH45,\"\")","v":""},null,null,null,{"$f":"IF(HL$2=1,Klimadaten!HL45,\"\")","v":15},null,null,null,null,null,null,null,null,null,null,null,null,null,null,null,null,null,null,null,{"$f":"IF(IF$2=1,Klimadaten!IF45,\"\")","v":""},null,null,null,{"$f":"IF(IJ$2=1,Klimadaten!IJ45,\"\")","v":""},null,null,null,{"$f":"IF(IN$2=1,Klimadaten!IN45,\"\")","v":""},null,null,null,{"$f":"IF(IR$2=1,Klimadaten!IR45,\"\")","v":""},null,null,null,{"$f":"IF(IV$2=1,Klimadaten!IV45,\"\")","v":""}]
[16,null,null,{"$f":"IF(D$2=1,Klimadaten!D46,\"\")","v":""},null,null,null,{"$f":"IF(H$2=1,Klimadaten!H46,\"\")","v":16},null,null,null,{"$f":"IF(L$2=1,Klimadaten!L46,\"\")","v":13},null,null,null,{"$f":"IF(P$2=1,Klimadaten!P46,\"\")","v":""},null,null,null,{"$f":"IF(T$2=1,Klimadaten!T46,\"\")","v":""},null,null,null,{"$f":"IF(X$2=1,Klimadaten!X46,\"\")","v":""},null,null,null,{"$f":"IF(AB$2=1,Klimadaten!AB46,\"\")","v":""},null,null,null,{"$f":"IF(AF$2=1,Klimadaten!AF46,\"\")","v":""},null,null,null,{"$f":"IF(AJ$2=1,Klimadaten!AJ46,\"\")","v":""},null,null,null,{"$f":"IF(AN$2=1,Klimadaten!AN46,\"\")","v":""},null,null,null,{"$f":"IF(AR$2=1,Klimadaten!AR46,\"\")","v":""},null,null,null,{"$f":"IF(AV$2=1,Klimadaten!AV46,\"\")","v":""},null,null,null,{"$f":"IF(AZ$2=1,Klimadaten!AZ46,\"\")","v":""},null,null,null,{"$f":"IF(BD$2=1,Klimadaten!BD46,\"\")","v":""},null,null,null,{"$f":"IF(BH$2=1,Klimadaten!BH46,\"\")","v":""},null,null,null,{"$f":"IF(BL$2=1,Klimadaten!BL46,\"\")","v":""},null,null,null,{"$f":"IF(BP$2=1,Klimadaten!BP46,\"\")","v":""},null,null,null,{"$f":"IF(BT$2=1,Klimadaten!BT46,\"\")","v":""},null,null,null,{"$f":"IF(BX$2=1,Klimadaten!BX46,\"\")","v":""},null,null,null,{"$f":"IF(CB$2=1,Klimadaten!CB46,\"\")","v":""},null,null,null,{"$f":"IF(CF$2=1,Klimadaten!CF46,\"\")","v":""},null,null,null,{"$f":"IF(CJ$2=1,Klimadaten!CJ46,\"\")","v":""},null,null,null,{"$f":"IF(CN$2=1,Klimadaten!CN46,\"\")","v":""},null,null,null,{"$f":"IF(CR$2=1,Klimadaten!CR46,\"\")","v":12},null,null,null,{"$f":"IF(CV$2=1,Klimadaten!CV46,\"\")","v":""},null,null,null,{"$f":"IF(CZ$2=1,Klimadaten!CZ46,\"\")","v":""},null,null,null,{"$f":"IF(DD$2=1,Klimadaten!DD46,\"\")","v":""},null,null,null,{"$f":"IF(DH$2=1,Klimadaten!DH46,\"\")","v":""},null,null,null,{"$f":"IF(DL$2=1,Klimadaten!DL46,\"\")","v":""},null,null,null,{"$f":"IF(DP$2=1,Klimadaten!DP46,\"\")","v":""},null,null,null,{"$f":"IF(DT$2=1,Klimadaten!DT46,\"\")","v":""},null,null,null,{"$f":"IF(DX$2=1,Klimadaten!DX46,\"\")","v":""},null,null,null,{"$f":"IF(EB$2=1,Klimadaten!EB46,\"\")","v":""},null,null,null,{"$f":"IF(EF$2=1,Klimadaten!EF46,\"\")","v":""},null,null,null,{"$f":"IF(EJ$2=1,Klimadaten!EJ46,\"\")","v":""},null,null,null,{"$f":"IF(EN$2=1,Klimadaten!EN46,\"\")","v":""},null,null,null,{"$f":"IF(ER$2=1,Klimadaten!ER46,\"\")","v":""},null,null,null,{"$f":"IF(EV$2=1,Klimadaten!EV46,\"\")","v":""},null,null,null,{"$f":"IF(EZ$2=1,Klimadaten!EZ46,\"\")","v":""},null,null,null,{"$f":"IF(FD$2=1,Klimadaten!FD46,\"\")","v":""},null,null,null,{"$f":"IF(FH$2=1,Klimadaten!FH46,\"\")","v":""},null,null,null,{"$f":"IF(FL$2=1,Klimadaten!FL46,\"\")","v":""},null,null,null,{"$f":"IF(FP$2=1,Klimadaten!FP46,\"\")","v":""},null,null,null,{"$f":"IF(FT$2=1,Klimadaten!FT46,\"\")","v":""},null,null,null,{"$f":"IF(FX$2=1,Klimadaten!FX46,\"\")","v":""},null,null,null,{"$f":"IF(GB$2=1,Klimadaten!GB46,\"\")","v":""},null,null,null,{"$f":"IF(GF$2=1,Klimadaten!GF46,\"\")","v":""},null,null,null,{"$f":"IF(GJ$2=1,Klimadaten!GJ46,\"\")","v":""},null,null,null,{"$f":"IF(GN$2=1,Klimadaten!GN46,\"\")","v":""},null,null,null,{"$f":"IF(GR$2=1,Klimadaten!GR46,\"\")","v":""},null,null,null,{"$f":"IF(GV$2=1,Klimadaten!GV46,\"\")","v":""},null,null,null,{"$f":"IF(GZ$2=1,Klimadaten!GZ46,\"\")","v":""},null,null,null,{"$f":"IF(HD$2=1,Klimadaten!HD46,\"\")","v":""},null,null,null,{"$f":"IF(HH$2=1,Klimadaten!HH46,\"\")","v":""},null,null,null,{"$f":"IF(HL$2=1,Klimadaten!HL46,\"\")","v":12},null,null,null,null,null,null,null,null,null,null,null,null,null,null,null,null,null,null,null,{"$f":"IF(IF$2=1,Klimadaten!IF46,\"\")","v":""},null,null,null,{"$f":"IF(IJ$2=1,Klimadaten!IJ46,\"\")","v":""},null,null,null,{"$f":"IF(IN$2=1,Klimadaten!IN46,\"\")","v":""},null,null,null,{"$f":"IF(IR$2=1,Klimadaten!IR46,\"\")","v":""},null,null,null,{"$f":"IF(IV$2=1,Klimadaten!IV46,\"\")","v":""}]
[17,null,null,{"$f":"IF(D$2=1,Klimadaten!D47,\"\")","v":""},null,null,null,{"$f":"IF(H$2=1,Klimadaten!H47,\"\")","v":17},null,null,null,{"$f":"IF(L$2=1,Klimadaten!L47,\"\")","v":18},null,null,null,{"$f":"IF(P$2=1,Klimadaten!P47,\"\")","v":""},null,null,null,{"$f":"IF(T$2=1,Klimadaten!T47,\"\")","v":""},null,null,null,{"$f":"IF(X$2=1,Klimadaten!X47,\"\")","v":""},null,null,null,{"$f":"IF(AB$2=1,Klimadaten!AB47,\"\")","v":""},null,null,null,{"$f":"IF(AF$2=1,Klimadaten!AF47,\"\")","v":""},null,null,null,{"$f":"IF(AJ$2=1,Klimadaten!AJ47,\"\")","v":""},null,null,null,{"$f":"IF(AN$2=1,Klimadaten!AN47,\"\")","v":""},null,null,null,{"$f":"IF(AR$2=1,Klimadaten!AR47,\"\")","v":""},null,null,null,{"$f":"IF(AV$2=1,Klimadaten!AV47,\"\")","v":""},null,null,null,{"$f":"IF(AZ$2=1,Klimadaten!AZ47,\"\")","v":""},null,null,null,{"$f":"IF(BD$2=1,Klimadaten!BD47,\"\")","v":""},null,null,null,{"$f":"IF(BH$2=1,Klimadaten!BH47,\"\")","v":""},null,null,null,{"$f":"IF(BL$2=1,Klimadaten!BL47,\"\")","v":""},null,null,null,{"$f":"IF(BP$2=1,Klimadaten!BP47,\"\")","v":""},null,null,null,{"$f":"IF(BT$2=1,Klimadaten!BT47,\"\")","v":""},null,null,null,{"$f":"IF(BX$2=1,Klimadaten!BX47,\"\")","v":""},null,null,null,{"$f":"IF(CB$2=1,Klimadaten!CB47,\"\")","v":""},null,null,null,{"$f":"IF(CF$2=1,Klimadaten!CF47,\"\")","v":""},null,null,null,{"$f":"IF(CJ$2=1,Klimadaten!CJ47,\"\")","v":""},null,null,null,{"$f":"IF(CN$2=1,Klimadaten!CN47,\"\")","v":""},null,null,null,{"$f":"IF(CR$2=1,Klimadaten!CR47,\"\")","v":11},null,null,null,{"$f":"IF(CV$2=1,Klimadaten!CV47,\"\")","v":""},null,null,null,{"$f":"IF(CZ$2=1,Klimadaten!CZ47,\"\")","v":""},null,null,null,{"$f":"IF(DD$2=1,Klimadaten!DD47,\"\")","v":""},null,null,null,{"$f":"IF(DH$2=1,Klimadaten!DH47,\"\")","v":""},null,null,null,{"$f":"IF(DL$2=1,Klimadaten!DL47,\"\")","v":""},null,null,null,{"$f":"IF(DP$2=1,Klimadaten!DP47,\"\")","v":""},null,null,null,{"$f":"IF(DT$2=1,Klimadaten!DT47,\"\")","v":""},null,null,null,{"$f":"IF(DX$2=1,Klimadaten!DX47,\"\")","v":""},null,null,null,{"$f":"IF(EB$2=1,Klimadaten!EB47,\"\")","v":""},null,null,null,{"$f":"IF(EF$2=1,Klimadaten!EF47,\"\")","v":""},null,null,null,{"$f":"IF(EJ$2=1,Klimadaten!EJ47,\"\")","v":""},null,null,null,{"$f":"IF(EN$2=1,Klimadaten!EN47,\"\")","v":""},null,null,null,{"$f":"IF(ER$2=1,Klimadaten!ER47,\"\")","v":""},null,null,null,{"$f":"IF(EV$2=1,Klimadaten!EV47,\"\")","v":""},null,null,null,{"$f":"IF(EZ$2=1,Klimadaten!EZ47,\"\")","v":""},null,null,null,{"$f":"IF(FD$2=1,Klimadaten!FD47,\"\")","v":""},null,null,null,{"$f":"IF(FH$2=1,Klimadaten!FH47,\"\")","v":""},null,null,null,{"$f":"IF(FL$2=1,Klimadaten!FL47,\"\")","v":""},null,null,null,{"$f":"IF(FP$2=1,Klimadaten!FP47,\"\")","v":""},null,null,null,{"$f":"IF(FT$2=1,Klimadaten!FT47,\"\")","v":""},null,null,null,{"$f":"IF(FX$2=1,Klimadaten!FX47,\"\")","v":""},null,null,null,{"$f":"IF(GB$2=1,Klimadaten!GB47,\"\")","v":""},null,null,null,{"$f":"IF(GF$2=1,Klimadaten!GF47,\"\")","v":""},null,null,null,{"$f":"IF(GJ$2=1,Klimadaten!GJ47,\"\")","v":""},null,null,null,{"$f":"IF(GN$2=1,Klimadaten!GN47,\"\")","v":""},null,null,null,{"$f":"IF(GR$2=1,Klimadaten!GR47,\"\")","v":""},null,null,null,{"$f":"IF(GV$2=1,Klimadaten!GV47,\"\")","v":""},null,null,null,{"$f":"IF(GZ$2=1,Klimadaten!GZ47,\"\")","v":""},null,null,null,{"$f":"IF(HD$2=1,Klimadaten!HD47,\"\")","v":""},null,null,null,{"$f":"IF(HH$2=1,Klimadaten!HH47,\"\")","v":""},null,null,null,{"$f":"IF(HL$2=1,Klimadaten!HL47,\"\")","v":9},null,null,null,null,null,null,null,null,null,null,null,null,null,null,null,null,null,null,null,{"$f":"IF(IF$2=1,Klimadaten!IF47,\"\")","v":""},null,null,null,{"$f":"IF(IJ$2=1,Klimadaten!IJ47,\"\")","v":""},null,null,null,{"$f":"IF(IN$2=1,Klimadaten!IN47,\"\")","v":""},null,null,null,{"$f":"IF(IR$2=1,Klimadaten!IR47,\"\")","v":""},null,null,null,{"$f":"IF(IV$2=1,Klimadaten!IV47,\"\")","v":""}]
[18,null,null,{"$f":"IF(D$2=1,Klimadaten!D48,\"\")","v":""},null,null,null,{"$f":"IF(H$2=1,Klimadaten!H48,\"\")","v":16},null,null,null,{"$f":"IF(L$2=1,Klimadaten!L48,\"\")","v":16},null,null,null,{"$f":"IF(P$2=1,Klimadaten!P48,\"\")","v":""},null,null,null,{"$f":"IF(T$2=1,Klimadaten!T48,\"\")","v":""},null,null,null,{"$f":"IF(X$2=1,Klimadaten!X48,\"\")","v":""},null,null,null,{"$f":"IF(AB$2=1,Klimadaten!AB48,\"\")","v":""},null,null,null,{"$f":"IF(AF$2=1,Klimadaten!AF48,\"\")","v":""},null,null,null,{"$f":"IF(AJ$2=1,Klimadaten!AJ48,\"\")","v":""},null,null,null,{"$f":"IF(AN$2=1,Klimadaten!AN48,\"\")","v":""},null,null,null,{"$f":"IF(AR$2=1,Klimadaten!AR48,\"\")","v":""},null,null,null,{"$f":"IF(AV$2=1,Klimadaten!AV48,\"\")","v":""},null,null,null,{"$f":"IF(AZ$2=1,Klimadaten!AZ48,\"\")","v":""},null,null,null,{"$f":"IF(BD$2=1,Klimadaten!BD48,\"\")","v":""},null,null,null,{"$f":"IF(BH$2=1,Klimadaten!BH48,\"\")","v":""},null,null,null,{"$f":"IF(BL$2=1,Klimadaten!BL48,\"\")","v":""},null,null,null,{"$f":"IF(BP$2=1,Klimadaten!BP48,\"\")","v":""},null,null,null,{"$f":"IF(BT$2=1,Klimadaten!BT48,\"\")","v":""},null,null,null,{"$f":"IF(BX$2=1,Klimadaten!BX48,\"\")","v":""},null,null,null,{"$f":"IF(CB$2=1,Klimadaten!CB48,\"\")","v":""},null,null,null,{"$f":"IF(CF$2=1,Klimadaten!CF48,\"\")","v":""},null,null,null,{"$f":"IF(CJ$2=1,Klimadaten!CJ48,\"\")","v":""},null,null,null,{"$f":"IF(CN$2=1,Klimadaten!CN48,\"\")","v":""},null,null,null,{"$f":"IF(CR$2=1,Klimadaten!CR48,\"\")","v":10},null,null,null,{"$f":"IF(CV$2=1,Klimadaten!CV48,\"\")","v":""},null,null,null,{"$f":"IF(CZ$2=1,Klimadaten!CZ48,\"\")","v":""},null,null,null,{"$f":"IF(DD$2=1,Klimadaten!DD48,\"\")","v":""},null,null,null,{"$f":"IF(DH$2=1,Klimadaten!DH48,\"\")","v":""},null,null,null,{"$f":"IF(DL$2=1,Klimadaten!DL48,\"\")","v":""},null,null,null,{"$f":"IF(DP$2=1,Klimadaten!DP48,\"\")","v":""},null,null,null,{"$f":"IF(DT$2=1,Klimadaten!DT48,\"\")","v":""},null,null,null,{"$f":"IF(DX$2=1,Klimadaten!DX48,\"\")","v":""},null,null,null,{"$f":"IF(EB$2=1,Klimadaten!EB48,\"\")","v":""},null,null,null,{"$f":"IF(EF$2=1,Klimadaten!EF48,\"\")","v":""},null,null,null,{"$f":"IF(EJ$2=1,Klimadaten!EJ48,\"\")","v":""},null,null,null,{"$f":"IF(EN$2=1,Klimadaten!EN48,\"\")","v":""},null,null,null,{"$f":"IF(ER$2=1,Klimadaten!ER48,\"\")","v":""},null,null,null,{"$f":"IF(EV$2=1,Klimadaten!EV48,\"\")","v":""},null,null,null,{"$f":"IF(EZ$2=1,Klimadaten!EZ48,\"\")","v":""},null,null,null,{"$f":"IF(FD$2=1,Klimadaten!FD48,\"\")","v":""},null,null,null,{"$f":"IF(FH$2=1,Klimadaten!FH48,\"\")","v":""},null,null,null,{"$f":"IF(FL$2=1,Klimadaten!FL48,\"\")","v":""},null,null,null,{"$f":"IF(FP$2=1,Klimadaten!FP48,\"\")","v":""},null,null,null,{"$f":"IF(FT$2=1,Klimadaten!FT48,\"\")","v":""},null,null,null,{"$f":"IF(FX$2=1,Klimadaten!FX48,\"\")","v":""},null,null,null,{"$f":"IF(GB$2=1,Klimadaten!GB48,\"\")","v":""},null,null,null,{"$f":"IF(GF$2=1,Klimadaten!GF48,\"\")","v":""},null,null,null,{"$f":"IF(GJ$2=1,Klimadaten!GJ48,\"\")","v":""},null,null,null,{"$f":"IF(GN$2=1,Klimadaten!GN48,\"\")","v":""},null,null,null,{"$f":"IF(GR$2=1,Klimadaten!GR48,\"\")","v":""},null,null,null,{"$f":"IF(GV$2=1,Klimadaten!GV48,\"\")","v":""},null,null,null,{"$f":"IF(GZ$2=1,Klimadaten!GZ48,\"\")","v":""},null,null,null,{"$f":"IF(HD$2=1,Klimadaten!HD48,\"\")","v":""},null,null,null,{"$f":"IF(HH$2=1,Klimadaten!HH48,\"\")","v":""},null,null,null,{"$f":"IF(HL$2=1,Klimadaten!HL48,\"\")","v":5},null,null,null,null,null,null,null,null,null,null,null,null,null,null,null,null,null,null,null,{"$f":"IF(IF$2=1,Klimadaten!IF48,\"\")","v":""},null,null,null,{"$f":"IF(IJ$2=1,Klimadaten!IJ48,\"\")","v":""},null,null,null,{"$f":"IF(IN$2=1,Klimadaten!IN48,\"\")","v":""},null,null,null,{"$f":"IF(IR$2=1,Klimadaten!IR48,\"\")","v":""},null,null,null,{"$f":"IF(IV$2=1,Klimadaten!IV48,\"\")","v":""}]
[19,null,null,{"$f":"IF(D$2=1,Klimadaten!D49,\"\")","v":""},null,null,null,{"$f":"IF(H$2=1,Klimadaten!H49,\"\")","v":10},null,null,null,{"$f":"IF(L$2=1,Klimadaten!L49,\"\")","v":18},null,null,null,{"$f":"IF(P$2=1,Klimadaten!P49,\"\")","v":""},null,null,null,{"$f":"IF(T$2=1,Klimadaten!T49,\"\")","v":""},null,null,null,{"$f":"IF(X$2=1,Klimadaten!X49,\"\")","v":""},null,null,null,{"$f":"IF(AB$2=1,Klimadaten!AB49,\"\")","v":""},null,null,null,{"$f":"IF(AF$2=1,Klimadaten!AF49,\"\")","v":""},null,null,null,{"$f":"IF(AJ$2=1,Klimadaten!AJ49,\"\")","v":""},null,null,null,{"$f":"IF(AN$2=1,Klimadaten!AN49,\"\")","v":""},null,null,null,{"$f":"IF(AR$2=1,Klimadaten!AR49,\"\")","v":""},null,null,null,{"$f":"IF(AV$2=1,Klimadaten!AV49,\"\")","v":""},null,null,null,{"$f":"IF(AZ$2=1,Klimadaten!AZ49,\"\")","v":""},null,null,null,{"$f":"IF(BD$2=1,Klimadaten!BD49,\"\")","v":""},null,null,null,{"$f":"IF(BH$2=1,Klimadaten!BH49,\"\")","v":""},null,null,null,{"$f":"IF(BL$2=1,Klimadaten!BL49,\"\")","v":""},null,null,null,{"$f":"IF(BP$2=1,Klimadaten!BP49,\"\")","v":""},null,null,null,{"$f":"IF(BT$2=1,Klimadaten!BT49,\"\")","v":""},null,null,null,{"$f":"IF(BX$2=1,Klimadaten!BX49,\"\")","v":""},null,null,null,{"$f":"IF(CB$2=1,Klimadaten!CB49,\"\")","v":""},null,null,null,{"$f":"IF(CF$2=1,Klimadaten!CF49,\"\")","v":""},null,null,null,{"$f":"IF(CJ$2=1,Klimadaten!CJ49,\"\")","v":""},null,null,null,{"$f":"IF(CN$2=1,Klimadaten!CN49,\"\")","v":""},null,null,null,{"$f":"IF(CR$2=1,Klimadaten!CR49,\"\")","v":6},null,null,null,{"$f":"IF(CV$2=1,Klimadaten!CV49,\"\")","v":""},null,null,null,{"$f":"IF(CZ$2=1,Klimadaten!CZ49,\"\")","v":""},null,null,null,{"$f":"IF(DD$2=1,Klimadaten!DD49,\"\")","v":""},null,null,null,{"$f":"IF(DH$2=1,Klimadaten!DH49,\"\")","v":""},null,null,null,{"$f":"IF(DL$2=1,Klimadaten!DL49,\"\")","v":""},null,null,null,{"$f":"IF(DP$2=1,Klimadaten!DP49,\"\")","v":""},null,null,null,{"$f":"IF(DT$2=1,Klimadaten!DT49,\"\")","v":""},null,null,null,{"$f":"IF(DX$2=1,Klimadaten!DX49,\"\")","v":""},null,null,null,{"$f":"IF(EB$2=1,Klimadaten!EB49,\"\")","v":""},null,null,null,{"$f":"IF(EF$2=1,Klimadaten!EF49,\"\")","v":""},null,null,null,{"$f":"IF(EJ$2=1,Klimadaten!EJ49,\"\")","v":""},null,null,null,{"$f":"IF(EN$2=1,Klimadaten!EN49,\"\")","v":""},null,null,null,{"$f":"IF(ER$2=1,Klimadaten!ER49,\"\")","v":""},null,null,null,{"$f":"IF(EV$2=1,Klimadaten!EV49,\"\")","v":""},null,null,null,{"$f":"IF(EZ$2=1,Klimadaten!EZ49,\"\")","v":""},null,null,null,{"$f":"IF(FD$2=1,Klimadaten!FD49,\"\")","v":""},null,null,null,{"$f":"IF(FH$2=1,Klimadaten!FH49,\"\")","v":""},null,null,null,{"$f":"IF(FL$2=1,Klimadaten!FL49,\"\")","v":""},null,null,null,{"$f":"IF(FP$2=1,Klimadaten!FP49,\"\")","v":""},null,null,null,{"$f":"IF(FT$2=1,Klimadaten!FT49,\"\")","v":""},null,null,null,{"$f":"IF(FX$2=1,Klimadaten!FX49,\"\")","v":""},null,null,null,{"$f":"IF(GB$2=1,Klimadaten!GB49,\"\")","v":""},null,null,null,{"$f":"IF(GF$2=1,Klimadaten!GF49,\"\")","v":""},null,null,null,{"$f":"IF(GJ$2=1,Klimadaten!GJ49,\"\")","v":""},null,null,null,{"$f":"IF(GN$2=1,Klimadaten!GN49,\"\")","v":""},null,null,null,{"$f":"IF(GR$2=1,Klimadaten!GR49,\"\")","v":""},null,null,null,{"$f":"IF(GV$2=1,Klimadaten!GV49,\"\")","v":""},null,null,null,{"$f":"IF(GZ$2=1,Klimadaten!GZ49,\"\")","v":""},null,null,null,{"$f":"IF(HD$2=1,Klimadaten!HD49,\"\")","v":""},null,null,null,{"$f":"IF(HH$2=1,Klimadaten!HH49,\"\")","v":""},null,null,null,{"$f":"IF(HL$2=1,Klimadaten!HL49,\"\")","v":3},null,null,null,null,null,null,null,null,null,null,null,null,null,null,null,null,null,null,null,{"$f":"IF(IF$2=1,Klimadaten!IF49,\"\")","v":""},null,null,null,{"$f":"IF(IJ$2=1,Klimadaten!IJ49,\"\")","v":""},null,null,null,{"$f":"IF(IN$2=1,Klimadaten!IN49,\"\")","v":""},null,null,null,{"$f":"IF(IR$2=1,Klimadaten!IR49,\"\")","v":""},null,null,null,{"$f":"IF(IV$2=1,Klimadaten!IV49,\"\")","v":""}]
[20,null,null,{"$f":"IF(D$2=1,Klimadaten!D50,\"\")","v":""},null,null,null,{"$f":"IF(H$2=1,Klimadaten!H50,\"\")","v":12},null,null,null,{"$f":"IF(L$2=1,Klimadaten!L50,\"\")","v":16},null,null,null,{"$f":"IF(P$2=1,Klimadaten!P50,\"\")","v":""},null,null,null,{"$f":"IF(T$2=1,Klimadaten!T50,\"\")","v":""},null,null,null,{"$f":"IF(X$2=1,Klimadaten!X50,\"\")","v":""},null,null,null,{"$f":"IF(AB$2=1,Klimadaten!AB50,\"\")","v":""},null,null,null,{"$f":"IF(AF$2=1,Klimadaten!AF50,\"\")","v":""},null,null,null,{"$f":"IF(AJ$2=1,Klimadaten!AJ50,\"\")","v":""},null,null,null,{"$f":"IF(AN$2=1,Klimadaten!AN50,\"\")","v":""},null,null,null,{"$f":"IF(AR$2=1,Klimadaten!AR50,\"\")","v":""},null,null,null,{"$f":"IF(AV$2=1,Klimadaten!AV50,\"\")","v":""},null,null,null,{"$f":"IF(AZ$2=1,Klimadaten!AZ50,\"\")","v":""},null,null,null,{"$f":"IF(BD$2=1,Klimadaten!BD50,\"\")","v":""},null,null,null,{"$f":"IF(BH$2=1,Klimadaten!BH50,\"\")","v":""},null,null,null,{"$f":"IF(BL$2=1,Klimadaten!BL50,\"\")","v":""},null,null,null,{"$f":"IF(BP$2=1,Klimadaten!BP50,\"\")","v":""},null,null,null,{"$f":"IF(BT$2=1,Klimadaten!BT50,\"\")","v":""},null,null,null,{"$f":"IF(BX$2=1,Klimadaten!BX50,\"\")","v":""},null,null,null,{"$f":"IF(CB$2=1,Klimadaten!CB50,\"\")","v":""},null,null,null,{"$f":"IF(CF$2=1,Klimadaten!CF50,\"\")","v":""},null,null,null,{"$f":"IF(CJ$2=1,Klimadaten!CJ50,\"\")","v":""},null,null,null,{"$f":"IF(CN$2=1,Klimadaten!CN50,\"\")","v":""},null,null,null,{"$f":"IF(CR$2=1,Klimadaten!CR50,\"\")","v":5},null,null,null,{"$f":"IF(CV$2=1,Klimadaten!CV50,\"\")","v":""},null,null,null,{"$f":"IF(CZ$2=1,Klimadaten!CZ50,\"\")","v":""},null,null,null,{"$f":"IF(DD$2=1,Klimadaten!DD50,\"\")","v":""},null,null,null,{"$f":"IF(DH$2=1,Klimadaten!DH50,\"\")","v":""},null,null,null,{"$f":"IF(DL$2=1,Klimadaten!DL50,\"\")","v":""},null,null,null,{"$f":"IF(DP$2=1,Klimadaten!DP50,\"\")","v":""},null,null,null,{"$f":"IF(DT$2=1,Klimadaten!DT50,\"\")","v":""},null,null,null,{"$f":"IF(DX$2=1,Klimadaten!DX50,\"\")","v":""},null,null,null,{"$f":"IF(EB$2=1,Klimadaten!EB50,\"\")","v":""},null,null,null,{"$f":"IF(EF$2=1,Klimadaten!EF50,\"\")","v":""},null,null,null,{"$f":"IF(EJ$2=1,Klimadaten!EJ50,\"\")","v":""},null,null,null,{"$f":"IF(EN$2=1,Klimadaten!EN50,\"\")","v":""},null,null,null,{"$f":"IF(ER$2=1,Klimadaten!ER50,\"\")","v":""},null,null,null,{"$f":"IF(EV$2=1,Klimadaten!EV50,\"\")","v":""},null,null,null,{"$f":"IF(EZ$2=1,Klimadaten!EZ50,\"\")","v":""},null,null,null,{"$f":"IF(FD$2=1,Klimadaten!FD50,\"\")","v":""},null,null,null,{"$f":"IF(FH$2=1,Klimadaten!FH50,\"\")","v":""},null,null,null,{"$f":"IF(FL$2=1,Klimadaten!FL50,\"\")","v":""},null,null,null,{"$f":"IF(FP$2=1,Klimadaten!FP50,\"\")","v":""},null,null,null,{"$f":"IF(FT$2=1,Klimadaten!FT50,\"\")","v":""},null,null,null,{"$f":"IF(FX$2=1,Klimadaten!FX50,\"\")","v":""},null,null,null,{"$f":"IF(GB$2=1,Klimadaten!GB50,\"\")","v":""},null,null,null,{"$f":"IF(GF$2=1,Klimadaten!GF50,\"\")","v":""},null,null,null,{"$f":"IF(GJ$2=1,Klimadaten!GJ50,\"\")","v":""},null,null,null,{"$f":"IF(GN$2=1,Klimadaten!GN50,\"\")","v":""},null,null,null,{"$f":"IF(GR$2=1,Klimadaten!GR50,\"\")","v":""},null,null,null,{"$f":"IF(GV$2=1,Klimadaten!GV50,\"\")","v":""},null,null,null,{"$f":"IF(GZ$2=1,Klimadaten!GZ50,\"\")","v":""},null,null,null,{"$f":"IF(HD$2=1,Klimadaten!HD50,\"\")","v":""},null,null,null,{"$f":"IF(HH$2=1,Klimadaten!HH50,\"\")","v":""},null,null,null,{"$f":"IF(HL$2=1,Klimadaten!HL50,\"\")","v":0},null,null,null,null,null,null,null,null,null,null,null,null,null,null,null,null,null,null,null,{"$f":"IF(IF$2=1,Klimadaten!IF50,\"\")","v":""},null,null,null,{"$f":"IF(IJ$2=1,Klimadaten!IJ50,\"\")","v":""},null,null,null,{"$f":"IF(IN$2=1,Klimadaten!IN50,\"\")","v":""},null,null,null,{"$f":"IF(IR$2=1,Klimadaten!IR50,\"\")","v":""},null,null,null,{"$f":"IF(IV$2=1,Klimadaten!IV50,\"\")","v":""}]
[21,null,null,{"$f":"IF(D$2=1,Klimadaten!D51,\"\")","v":""},null,null,null,{"$f":"IF(H$2=1,Klimadaten!H51,\"\")","v":10},null,null,null,{"$f":"IF(L$2=1,Klimadaten!L51,\"\")","v":15},null,null,null,{"$f":"IF(P$2=1,Klimadaten!P51,\"\")","v":""},null,null,null,{"$f":"IF(T$2=1,Klimadaten!T51,\"\")","v":""},null,null,null,{"$f":"IF(X$2=1,Klimadaten!X51,\"\")","v":""},null,null,null,{"$f":"IF(AB$2=1,Klimadaten!AB51,\"\")","v":""},null,null,null,{"$f":"IF(AF$2=1,Klimadaten!AF51,\"\")","v":""},null,null,null,{"$f":"IF(AJ$2=1,Klimadaten!AJ51,\"\")","v":""},null,null,null,{"$f":"IF(AN$2=1,Klimadaten!AN51,\"\")","v":""},null,null,null,{"$f":"IF(AR$2=1,Klimadaten!AR51,\"\")","v":""},null,null,null,{"$f":"IF(AV$2=1,Klimadaten!AV51,\"\")","v":""},null,null,null,{"$f":"IF(AZ$2=1,Klimadaten!AZ51,\"\")","v":""},null,null,null,{"$f":"IF(BD$2=1,Klimadaten!BD51,\"\")","v":""},null,null,null,{"$f":"IF(BH$2=1,Klimadaten!BH51,\"\")","v":""},null,null,null,{"$f":"IF(BL$2=1,Klimadaten!BL51,\"\")","v":""},null,null,null,{"$f":"IF(BP$2=1,Klimadaten!BP51,\"\")","v":""},null,null,null,{"$f":"IF(BT$2=1,Klimadaten!BT51,\"\")","v":""},null,null,null,{"$f":"IF(BX$2=1,Klimadaten!BX51,\"\")","v":""},null,null,null,{"$f":"IF(CB$2=1,Klimadaten!CB51,\"\")","v":""},null,null,null,{"$f":"IF(CF$2=1,Klimadaten!CF51,\"\")","v":""},null,null,null,{"$f":"IF(CJ$2=1,Klimadaten!CJ51,\"\")","v":""},null,null,null,{"$f":"IF(CN$2=1,Klimadaten!CN51,\"\")","v":""},null,null,null,{"$f":"IF(CR$2=1,Klimadaten!CR51,\"\")","v":3},null,null,null,{"$f":"IF(CV$2=1,Klimadaten!CV51,\"\")","v":""},null,null,null,{"$f":"IF(CZ$2=1,Klimadaten!CZ51,\"\")","v":""},null,null,null,{"$f":"IF(DD$2=1,Klimadaten!DD51,\"\")","v":""},null,null,null,{"$f":"IF(DH$2=1,Klimadaten!DH51,\"\")","v":""},null,null,null,{"$f":"IF(DL$2=1,Klimadaten!DL51,\"\")","v":""},null,null,null,{"$f":"IF(DP$2=1,Klimadaten!DP51,\"\")","v":""},null,null,null,{"$f":"IF(DT$2=1,Klimadaten!DT51,\"\")","v":""},null,null,null,{"$f":"IF(DX$2=1,Klimadaten!DX51,\"\")","v":""},null,null,null,{"$f":"IF(EB$2=1,Klimadaten!EB51,\"\")","v":""},null,null,null,{"$f":"IF(EF$2=1,Klimadaten!EF51,\"\")","v":""},null,null,null,{"$f":"IF(EJ$2=1,Klimadaten!EJ51,\"\")","v":""},null,null,null,{"$f":"IF(EN$2=1,Klimadaten!EN51,\"\")","v":""},null,null,null,{"$f":"IF(ER$2=1,Klimadaten!ER51,\"\")","v":""},null,null,null,{"$f":"IF(EV$2=1,Klimadaten!EV51,\"\")","v":""},null,null,null,{"$f":"IF(EZ$2=1,Klimadaten!EZ51,\"\")","v":""},null,null,null,{"$f":"IF(FD$2=1,Klimadaten!FD51,\"\")","v":""},null,null,null,{"$f":"IF(FH$2=1,Klimadaten!FH51,\"\")","v":""},null,null,null,{"$f":"IF(FL$2=1,Klimadaten!FL51,\"\")","v":""},null,null,null,{"$f":"IF(FP$2=1,Klimadaten!FP51,\"\")","v":""},null,null,null,{"$f":"IF(FT$2=1,Klimadaten!FT51,\"\")","v":""},null,null,null,{"$f":"IF(FX$2=1,Klimadaten!FX51,\"\")","v":""},null,null,null,{"$f":"IF(GB$2=1,Klimadaten!GB51,\"\")","v":""},null,null,null,{"$f":"IF(GF$2=1,Klimadaten!GF51,\"\")","v":""},null,null,null,{"$f":"IF(GJ$2=1,Klimadaten!GJ51,\"\")","v":""},null,null,null,{"$f":"IF(GN$2=1,Klimadaten!GN51,\"\")","v":""},null,null,null,{"$f":"IF(GR$2=1,Klimadaten!GR51,\"\")","v":""},null,null,null,{"$f":"IF(GV$2=1,Klimadaten!GV51,\"\")","v":""},null,null,null,{"$f":"IF(GZ$2=1,Klimadaten!GZ51,\"\")","v":""},null,null,null,{"$f":"IF(HD$2=1,Klimadaten!HD51,\"\")","v":""},null,null,null,{"$f":"IF(HH$2=1,Klimadaten!HH51,\"\")","v":""},null,null,null,{"$f":"IF(HL$2=1,Klimadaten!HL51,\"\")","v":0},null,null,null,null,null,null,null,null,null,null,null,null,null,null,null,null,null,null,null,{"$f":"IF(IF$2=1,Klimadaten!IF51,\"\")","v":""},null,null,null,{"$f":"IF(IJ$2=1,Klimadaten!IJ51,\"\")","v":""},null,null,null,{"$f":"IF(IN$2=1,Klimadaten!IN51,\"\")","v":""},null,null,null,{"$f":"IF(IR$2=1,Klimadaten!IR51,\"\")","v":""},null,null,null,{"$f":"IF(IV$2=1,Klimadaten!IV51,\"\")","v":""}]
[22,null,null,{"$f":"IF(D$2=1,Klimadaten!D52,\"\")","v":""},null,null,null,{"$f":"IF(H$2=1,Klimadaten!H52,\"\")","v":7},null,null,null,{"$f":"IF(L$2=1,Klimadaten!L52,\"\")","v":16},null,null,null,{"$f":"IF(P$2=1,Klimadaten!P52,\"\")","v":""},null,null,null,{"$f":"IF(T$2=1,Klimadaten!T52,\"\")","v":""},null,null,null,{"$f":"IF(X$2=1,Klimadaten!X52,\"\")","v":""},null,null,null,{"$f":"IF(AB$2=1,Klimadaten!AB52,\"\")","v":""},null,null,null,{"$f":"IF(AF$2=1,Klimadaten!AF52,\"\")","v":""},null,null,null,{"$f":"IF(AJ$2=1,Klimadaten!AJ52,\"\")","v":""},null,null,null,{"$f":"IF(AN$2=1,Klimadaten!AN52,\"\")","v":""},null,null,null,{"$f":"IF(AR$2=1,Klimadaten!AR52,\"\")","v":""},null,null,null,{"$f":"IF(AV$2=1,Klimadaten!AV52,\"\")","v":""},null,null,null,{"$f":"IF(AZ$2=1,Klimadaten!AZ52,\"\")","v":""},null,null,null,{"$f":"IF(BD$2=1,Klimadaten!BD52,\"\")","v":""},null,null,null,{"$f":"IF(BH$2=1,Klimadaten!BH52,\"\")","v":""},null,null,null,{"$f":"IF(BL$2=1,Klimadaten!BL52,\"\")","v":""},null,null,null,{"$f":"IF(BP$2=1,Klimadaten!BP52,\"\")","v":""},null,null,null,{"$f":"IF(BT$2=1,Klimadaten!BT52,\"\")","v":""},null,null,null,{"$f":"IF(BX$2=1,Klimadaten!BX52,\"\")","v":""},null,null,null,{"$f":"IF(CB$2=1,Klimadaten!CB52,\"\")","v":""},null,null,null,{"$f":"IF(CF$2=1,Klimadaten!CF52,\"\")","v":""},null,null,null,{"$f":"IF(CJ$2=1,Klimadaten!CJ52,\"\")","v":""},null,null,null,{"$f":"IF(CN$2=1,Klimadaten!CN52,\"\")","v":""},null,null,null,{"$f":"IF(CR$2=1,Klimadaten!CR52,\"\")","v":2},null,null,null,{"$f":"IF(CV$2=1,Klimadaten!CV52,\"\")","v":""},null,null,null,{"$f":"IF(CZ$2=1,Klimadaten!CZ52,\"\")","v":""},null,null,null,{"$f":"IF(DD$2=1,Klimadaten!DD52,\"\")","v":""},null,null,null,{"$f":"IF(DH$2=1,Klimadaten!DH52,\"\")","v":""},null,null,null,{"$f":"IF(DL$2=1,Klimadaten!DL52,\"\")","v":""},null,null,null,{"$f":"IF(DP$2=1,Klimadaten!DP52,\"\")","v":""},null,null,null,{"$f":"IF(DT$2=1,Klimadaten!DT52,\"\")","v":""},null,null,null,{"$f":"IF(DX$2=1,Klimadaten!DX52,\"\")","v":""},null,null,null,{"$f":"IF(EB$2=1,Klimadaten!EB52,\"\")","v":""},null,null,null,{"$f":"IF(EF$2=1,Klimadaten!EF52,\"\")","v":""},null,null,null,{"$f":"IF(EJ$2=1,Klimadaten!EJ52,\"\")","v":""},null,null,null,{"$f":"IF(EN$2=1,Klimadaten!EN52,\"\")","v":""},null,null,null,{"$f":"IF(ER$2=1,Klimadaten!ER52,\"\")","v":""},null,null,null,{"$f":"IF(EV$2=1,Klimadaten!EV52,\"\")","v":""},null,null,null,{"$f":"IF(EZ$2=1,Klimadaten!EZ52,\"\")","v":""},null,null,null,{"$f":"IF(FD$2=1,Klimadaten!FD52,\"\")","v":""},null,null,null,{"$f":"IF(FH$2=1,Klimadaten!FH52,\"\")","v":""},null,null,null,{"$f":"IF(FL$2=1,Klimadaten!FL52,\"\")","v":""},null,null,null,{"$f":"IF(FP$2=1,Klimadaten!FP52,\"\")","v":""},null,null,null,{"$f":"IF(FT$2=1,Klimadaten!FT52,\"\")","v":""},null,null,null,{"$f":"IF(FX$2=1,Klimadaten!FX52,\"\")","v":""},null,null,null,{"$f":"IF(GB$2=1,Klimadaten!GB52,\"\")","v":""},null,null,null,{"$f":"IF(GF$2=1,Klimadaten!GF52,\"\")","v":""},null,null,null,{"$f":"IF(GJ$2=1,Klimadaten!GJ52,\"\")","v":""},null,null,null,{"$f":"IF(GN$2=1,Klimadaten!GN52,\"\")","v":""},null,null,null,{"$f":"IF(GR$2=1,Klimadaten!GR52,\"\")","v":""},null,null,null,{"$f":"IF(GV$2=1,Klimadaten!GV52,\"\")","v":""},null,null,null,{"$f":"IF(GZ$2=1,Klimadaten!GZ52,\"\")","v":""},null,null,null,{"$f":"IF(HD$2=1,Klimadaten!HD52,\"\")","v":""},null,null,null,{"$f":"IF(HH$2=1,Klimadaten!HH52,\"\")","v":""},null,null,null,{"$f":"IF(HL$2=1,Klimadaten!HL52,\"\")","v":0},null,null,null,null,null,null,null,null,null,null,null,null,null,null,null,null,null,null,null,{"$f":"IF(IF$2=1,Klimadaten!IF52,\"\")","v":""},null,null,null,{"$f":"IF(IJ$2=1,Klimadaten!IJ52,\"\")","v":""},null,null,null,{"$f":"IF(IN$2=1,Klimadaten!IN52,\"\")","v":""},null,null,null,{"$f":"IF(IR$2=1,Klimadaten!IR52,\"\")","v":""},null,null,null,{"$f":"IF(IV$2=1,Klimadaten!IV52,\"\")","v":""}]
[23,null,null,{"$f":"IF(D$2=1,Klimadaten!D53,\"\")","v":""},null,null,null,{"$f":"IF(H$2=1,Klimadaten!H53,\"\")","v":5},null,null,null,{"$f":"IF(L$2=1,Klimadaten!L53,\"\")","v":14},null,null,null,{"$f":"IF(P$2=1,Klimadaten!P53,\"\")","v":""},null,null,null,{"$f":"IF(T$2=1,Klimadaten!T53,\"\")","v":""},null,null,null,{"$f":"IF(X$2=1,Klimadaten!X53,\"\")","v":""},null,null,null,{"$f":"IF(AB$2=1,Klimadaten!AB53,\"\")","v":""},null,null,null,{"$f":"IF(AF$2=1,Klimadaten!AF53,\"\")","v":""},null,null,null,{"$f":"IF(AJ$2=1,Klimadaten!AJ53,\"\")","v":""},null,null,null,{"$f":"IF(AN$2=1,Klimadaten!AN53,\"\")","v":""},null,null,null,{"$f":"IF(AR$2=1,Klimadaten!AR53,\"\")","v":""},null,null,null,{"$f":"IF(AV$2=1,Klimadaten!AV53,\"\")","v":""},null,null,null,{"$f":"IF(AZ$2=1,Klimadaten!AZ53,\"\")","v":""},null,null,null,{"$f":"IF(BD$2=1,Klimadaten!BD53,\"\")","v":""},null,null,null,{"$f":"IF(BH$2=1,Klimadaten!BH53,\"\")","v":""},null,null,null,{"$f":"IF(BL$2=1,Klimadaten!BL53,\"\")","v":""},null,null,null,{"$f":"IF(BP$2=1,Klimadaten!BP53,\"\")","v":""},null,null,null,{"$f":"IF(BT$2=1,Klimadaten!BT53,\"\")","v":""},null,null,null,{"$f":"IF(BX$2=1,Klimadaten!BX53,\"\")","v":""},null,null,null,{"$f":"IF(CB$2=1,Klimadaten!CB53,\"\")","v":""},null,null,null,{"$f":"IF(CF$2=1,Klimadaten!CF53,\"\")","v":""},null,null,null,{"$f":"IF(CJ$2=1,Klimadaten!CJ53,\"\")","v":""},null,null,null,{"$f":"IF(CN$2=1,Klimadaten!CN53,\"\")","v":""},null,null,null,{"$f":"IF(CR$2=1,Klimadaten!CR53,\"\")","v":0},null,null,null,{"$f":"IF(CV$2=1,Klimadaten!CV53,\"\")","v":""},null,null,null,{"$f":"IF(CZ$2=1,Klimadaten!CZ53,\"\")","v":""},null,null,null,{"$f":"IF(DD$2=1,Klimadaten!DD53,\"\")","v":""},null,null,null,{"$f":"IF(DH$2=1,Klimadaten!DH53,\"\")","v":""},null,null,null,{"$f":"IF(DL$2=1,Klimadaten!DL53,\"\")","v":""},null,null,null,{"$f":"IF(DP$2=1,Klimadaten!DP53,\"\")","v":""},null,null,null,{"$f":"IF(DT$2=1,Klimadaten!DT53,\"\")","v":""},null,null,null,{"$f":"IF(DX$2=1,Klimadaten!DX53,\"\")","v":""},null,null,null,{"$f":"IF(EB$2=1,Klimadaten!EB53,\"\")","v":""},null,null,null,{"$f":"IF(EF$2=1,Klimadaten!EF53,\"\")","v":""},null,null,null,{"$f":"IF(EJ$2=1,Klimadaten!EJ53,\"\")","v":""},null,null,null,{"$f":"IF(EN$2=1,Klimadaten!EN53,\"\")","v":""},null,null,null,{"$f":"IF(ER$2=1,Klimadaten!ER53,\"\")","v":""},null,null,null,{"$f":"IF(EV$2=1,Klimadaten!EV53,\"\")","v":""},null,null,null,{"$f":"IF(EZ$2=1,Klimadaten!EZ53,\"\")","v":""},null,null,null,{"$f":"IF(FD$2=1,Klimadaten!FD53,\"\")","v":""},null,null,null,{"$f":"IF(FH$2=1,Klimadaten!FH53,\"\")","v":""},null,null,null,{"$f":"IF(FL$2=1,Klimadaten!FL53,\"\")","v":""},null,null,null,{"$f":"IF(FP$2=1,Klimadaten!FP53,\"\")","v":""},null,null,null,{"$f":"IF(FT$2=1,Klimadaten!FT53,\"\")","v":""},null,null,null,{"$f":"IF(FX$2=1,Klimadaten!FX53,\"\")","v":""},null,null,null,{"$f":"IF(GB$2=1,Klimadaten!GB53,\"\")","v":""},null,null,null,{"$f":"IF(GF$2=1,Klimadaten!GF53,\"\")","v":""},null,null,null,{"$f":"IF(GJ$2=1,Klimadaten!GJ53,\"\")","v":""},null,null,null,{"$f":"IF(GN$2=1,Klimadaten!GN53,\"\")","v":""},null,null,null,{"$f":"IF(GR$2=1,Klimadaten!GR53,\"\")","v":""},null,null,null,{"$f":"IF(GV$2=1,Klimadaten!GV53,\"\")","v":""},null,null,null,{"$f":"IF(GZ$2=1,Klimadaten!GZ53,\"\")","v":""},null,null,null,{"$f":"IF(HD$2=1,Klimadaten!HD53,\"\")","v":""},null,null,null,{"$f":"IF(HH$2=1,Klimadaten!HH53,\"\")","v":""},null,null,null,{"$f":"IF(HL$2=1,Klimadaten!HL53,\"\")","v":0},null,null,null,null,null,null,null,null,null,null,null,null,null,null,null,null,null,null,null,{"$f":"IF(IF$2=1,Klimadaten!IF53,\"\")","v":""},null,null,null,{"$f":"IF(IJ$2=1,Klimadaten!IJ53,\"\")","v":""},null,null,null,{"$f":"IF(IN$2=1,Klimadaten!IN53,\"\")","v":""},null,null,null,{"$f":"IF(IR$2=1,Klimadaten!IR53,\"\")","v":""},null,null,null,{"$f":"IF(IV$2=1,Klimadaten!IV53,\"\")","v":""}]
[24,null,null,{"$f":"IF(D$2=1,Klimadaten!D54,\"\")","v":""},null,null,null,{"$f":"IF(H$2=1,Klimadaten!H54,\"\")","v":3},null,null,null,{"$f":"IF(L$2=1,Klimadaten!L54,\"\")","v":12},null,null,null,{"$f":"IF(P$2=1,Klimadaten!P54,\"\")","v":""},null,null,null,{"$f":"IF(T$2=1,Klimadaten!T54,\"\")","v":""},null,null,null,{"$f":"IF(X$2=1,Klimadaten!X54,\"\")","v":""},null,null,null,{"$f":"IF(AB$2=1,Klimadaten!AB54,\"\")","v":""},null,null,null,{"$f":"IF(AF$2=1,Klimadaten!AF54,\"\")","v":""},null,null,null,{"$f":"IF(AJ$2=1,Klimadaten!AJ54,\"\")","v":""},null,null,null,{"$f":"IF(AN$2=1,Klimadaten!AN54,\"\")","v":""},null,null,null,{"$f":"IF(AR$2=1,Klimadaten!AR54,\"\")","v":""},null,null,null,{"$f":"IF(AV$2=1,Klimadaten!AV54,\"\")","v":""},null,null,null,{"$f":"IF(AZ$2=1,Klimadaten!AZ54,\"\")","v":""},null,null,null,{"$f":"IF(BD$2=1,Klimadaten!BD54,\"\")","v":""},null,null,null,{"$f":"IF(BH$2=1,Klimadaten!BH54,\"\")","v":""},null,null,null,{"$f":"IF(BL$2=1,Klimadaten!BL54,\"\")","v":""},null,null,null,{"$f":"IF(BP$2=1,Klimadaten!BP54,\"\")","v":""},null,null,null,{"$f":"IF(BT$2=1,Klimadaten!BT54,\"\")","v":""},null,null,null,{"$f":"IF(BX$2=1,Klimadaten!BX54,\"\")","v":""},null,null,null,{"$f":"IF(CB$2=1,Klimadaten!CB54,\"\")","v":""},null,null,null,{"$f":"IF(CF$2=1,Klimadaten!CF54,\"\")","v":""},null,null,null,{"$f":"IF(CJ$2=1,Klimadaten!CJ54,\"\")","v":""},null,null,null,{"$f":"IF(CN$2=1,Klimadaten!CN54,\"\")","v":""},null,null,null,{"$f":"IF(CR$2=1,Klimadaten!CR54,\"\")","v":0},null,null,null,{"$f":"IF(CV$2=1,Klimadaten!CV54,\"\")","v":""},null,null,null,{"$f":"IF(CZ$2=1,Klimadaten!CZ54,\"\")","v":""},null,null,null,{"$f":"IF(DD$2=1,Klimadaten!DD54,\"\")","v":""},null,null,null,{"$f":"IF(DH$2=1,Klimadaten!DH54,\"\")","v":""},null,null,null,{"$f":"IF(DL$2=1,Klimadaten!DL54,\"\")","v":""},null,null,null,{"$f":"IF(DP$2=1,Klimadaten!DP54,\"\")","v":""},null,null,null,{"$f":"IF(DT$2=1,Klimadaten!DT54,\"\")","v":""},null,null,null,{"$f":"IF(DX$2=1,Klimadaten!DX54,\"\")","v":""},null,null,null,{"$f":"IF(EB$2=1,Klimadaten!EB54,\"\")","v":""},null,null,null,{"$f":"IF(EF$2=1,Klimadaten!EF54,\"\")","v":""},null,null,null,{"$f":"IF(EJ$2=1,Klimadaten!EJ54,\"\")","v":""},null,null,null,{"$f":"IF(EN$2=1,Klimadaten!EN54,\"\")","v":""},null,null,null,{"$f":"IF(ER$2=1,Klimadaten!ER54,\"\")","v":""},null,null,null,{"$f":"IF(EV$2=1,Klimadaten!EV54,\"\")","v":""},null,null,null,{"$f":"IF(EZ$2=1,Klimadaten!EZ54,\"\")","v":""},null,null,null,{"$f":"IF(FD$2=1,Klimadaten!FD54,\"\")","v":""},null,null,null,{"$f":"IF(FH$2=1,Klimadaten!FH54,\"\")","v":""},null,null,null,{"$f":"IF(FL$2=1,Klimadaten!FL54,\"\")","v":""},null,null,null,{"$f":"IF(FP$2=1,Klimadaten!FP54,\"\")","v":""},null,null,null,{"$f":"IF(FT$2=1,Klimadaten!FT54,\"\")","v":""},null,null,null,{"$f":"IF(FX$2=1,Klimadaten!FX54,\"\")","v":""},null,null,null,{"$f":"IF(GB$2=1,Klimadaten!GB54,\"\")","v":""},null,null,null,{"$f":"IF(GF$2=1,Klimadaten!GF54,\"\")","v":""},null,null,null,{"$f":"IF(GJ$2=1,Klimadaten!GJ54,\"\")","v":""},null,null,null,{"$f":"IF(GN$2=1,Klimadaten!GN54,\"\")","v":""},null,null,null,{"$f":"IF(GR$2=1,Klimadaten!GR54,\"\")","v":""},null,null,null,{"$f":"IF(GV$2=1,Klimadaten!GV54,\"\")","v":""},null,null,null,{"$f":"IF(GZ$2=1,Klimadaten!GZ54,\"\")","v":""},null,null,null,{"$f":"IF(HD$2=1,Klimadaten!HD54,\"\")","v":""},null,null,null,{"$f":"IF(HH$2=1,Klimadaten!HH54,\"\")","v":""},null,null,null,{"$f":"IF(HL$2=1,Klimadaten!HL54,\"\")","v":0},null,null,null,null,null,null,null,null,null,null,null,null,null,null,null,null,null,null,null,{"$f":"IF(IF$2=1,Klimadaten!IF54,\"\")","v":""},null,null,null,{"$f":"IF(IJ$2=1,Klimadaten!IJ54,\"\")","v":""},null,null,null,{"$f":"IF(IN$2=1,Klimadaten!IN54,\"\")","v":""},null,null,null,{"$f":"IF(IR$2=1,Klimadaten!IR54,\"\")","v":""},null,null,null,{"$f":"IF(IV$2=1,Klimadaten!IV54,\"\")","v":""}]
[25,null,null,{"$f":"IF(D$2=1,Klimadaten!D55,\"\")","v":""},null,null,null,{"$f":"IF(H$2=1,Klimadaten!H55,\"\")","v":2},null,null,null,{"$f":"IF(L$2=1,Klimadaten!L55,\"\")","v":6},null,null,null,{"$f":"IF(P$2=1,Klimadaten!P55,\"\")","v":""},null,null,null,{"$f":"IF(T$2=1,Klimadaten!T55,\"\")","v":""},null,null,null,{"$f":"IF(X$2=1,Klimadaten!X55,\"\")","v":""},null,null,null,{"$f":"IF(AB$2=1,Klimadaten!AB55,\"\")","v":""},null,null,null,{"$f":"IF(AF$2=1,Klimadaten!AF55,\"\")","v":""},null,null,null,{"$f":"IF(AJ$2=1,Klimadaten!AJ55,\"\")","v":""},null,null,null,{"$f":"IF(AN$2=1,Klimadaten!AN55,\"\")","v":""},null,null,null,{"$f":"IF(AR$2=1,Klimadaten!AR55,\"\")","v":""},null,null,null,{"$f":"IF(AV$2=1,Klimadaten!AV55,\"\")","v":""},null,null,null,{"$f":"IF(AZ$2=1,Klimadaten!AZ55,\"\")","v":""},null,null,null,{"$f":"IF(BD$2=1,Klimadaten!BD55,\"\")","v":""},null,null,null,{"$f":"IF(BH$2=1,Klimadaten!BH55,\"\")","v":""},null,null,null,{"$f":"IF(BL$2=1,Klimadaten!BL55,\"\")","v":""},null,null,null,{"$f":"IF(BP$2=1,Klimadaten!BP55,\"\")","v":""},null,null,null,{"$f":"IF(BT$2=1,Klimadaten!BT55,\"\")","v":""},null,null,null,{"$f":"IF(BX$2=1,Klimadaten!BX55,\"\")","v":""},null,null,null,{"$f":"IF(CB$2=1,Klimadaten!CB55,\"\")","v":""},null,null,null,{"$f":"IF(CF$2=1,Klimadaten!CF55,\"\")","v":""},null,null,null,{"$f":"IF(CJ$2=1,Klimadaten!CJ55,\"\")","v":""},null,null,null,{"$f":"IF(CN$2=1,Klimadaten!CN55,\"\")","v":""},null,null,null,{"$f":"IF(CR$2=1,Klimadaten!CR55,\"\")","v":0},null,null,null,{"$f":"IF(CV$2=1,Klimadaten!CV55,\"\")","v":""},null,null,null,{"$f":"IF(CZ$2=1,Klimadaten!CZ55,\"\")","v":""},null,null,null,{"$f":"IF(DD$2=1,Klimadaten!DD55,\"\")","v":""},null,null,null,{"$f":"IF(DH$2=1,Klimadaten!DH55,\"\")","v":""},null,null,null,{"$f":"IF(DL$2=1,Klimadaten!DL55,\"\")","v":""},null,null,null,{"$f":"IF(DP$2=1,Klimadaten!DP55,\"\")","v":""},null,null,null,{"$f":"IF(DT$2=1,Klimadaten!DT55,\"\")","v":""},null,null,null,{"$f":"IF(DX$2=1,Klimadaten!DX55,\"\")","v":""},null,null,null,{"$f":"IF(EB$2=1,Klimadaten!EB55,\"\")","v":""},null,null,null,{"$f":"IF(EF$2=1,Klimadaten!EF55,\"\")","v":""},null,null,null,{"$f":"IF(EJ$2=1,Klimadaten!EJ55,\"\")","v":""},null,null,null,{"$f":"IF(EN$2=1,Klimadaten!EN55,\"\")","v":""},null,null,null,{"$f":"IF(ER$2=1,Klimadaten!ER55,\"\")","v":""},null,null,null,{"$f":"IF(EV$2=1,Klimadaten!EV55,\"\")","v":""},null,null,null,{"$f":"IF(EZ$2=1,Klimadaten!EZ55,\"\")","v":""},null,null,null,{"$f":"IF(FD$2=1,Klimadaten!FD55,\"\")","v":""},null,null,null,{"$f":"IF(FH$2=1,Klimadaten!FH55,\"\")","v":""},null,null,null,{"$f":"IF(FL$2=1,Klimadaten!FL55,\"\")","v":""},null,null,null,{"$f":"IF(FP$2=1,Klimadaten!FP55,\"\")","v":""},null,null,null,{"$f":"IF(FT$2=1,Klimadaten!FT55,\"\")","v":""},null,null,null,{"$f":"IF(FX$2=1,Klimadaten!FX55,\"\")","v":""},null,null,null,{"$f":"IF(GB$2=1,Klimadaten!GB55,\"\")","v":""},null,null,null,{"$f":"IF(GF$2=1,Klimadaten!GF55,\"\")","v":""},null,null,null,{"$f":"IF(GJ$2=1,Klimadaten!GJ55,\"\")","v":""},null,null,null,{"$f":"IF(GN$2=1,Klimadaten!GN55,\"\")","v":""},null,null,null,{"$f":"IF(GR$2=1,Klimadaten!GR55,\"\")","v":""},null,null,null,{"$f":"IF(GV$2=1,Klimadaten!GV55,\"\")","v":""},null,null,null,{"$f":"IF(GZ$2=1,Klimadaten!GZ55,\"\")","v":""},null,null,null,{"$f":"IF(HD$2=1,Klimadaten!HD55,\"\")","v":""},null,null,null,{"$f":"IF(HH$2=1,Klimadaten!HH55,\"\")","v":""},null,null,null,{"$f":"IF(HL$2=1,Klimadaten!HL55,\"\")","v":0},null,null,null,null,null,null,null,null,null,null,null,null,null,null,null,null,null,null,null,{"$f":"IF(IF$2=1,Klimadaten!IF55,\"\")","v":""},null,null,null,{"$f":"IF(IJ$2=1,Klimadaten!IJ55,\"\")","v":""},null,null,null,{"$f":"IF(IN$2=1,Klimadaten!IN55,\"\")","v":""},null,null,null,{"$f":"IF(IR$2=1,Klimadaten!IR55,\"\")","v":""},null,null,null,{"$f":"IF(IV$2=1,Klimadaten!IV55,\"\")","v":""}]
[26,null,null,{"$f":"IF(D$2=1,Klimadaten!D56,\"\")","v":""},null,null,null,{"$f":"IF(H$2=1,Klimadaten!H56,\"\")","v":1},null,null,null,{"$f":"IF(L$2=1,Klimadaten!L56,\"\")","v":5},null,null,null,{"$f":"IF(P$2=1,Klimadaten!P56,\"\")","v":""},null,null,null,{"$f":"IF(T$2=1,Klimadaten!T56,\"\")","v":""},null,null,null,{"$f":"IF(X$2=1,Klimadaten!X56,\"\")","v":""},null,null,null,{"$f":"IF(AB$2=1,Klimadaten!AB56,\"\")","v":""},null,null,null,{"$f":"IF(AF$2=1,Klimadaten!AF56,\"\")","v":""},null,null,null,{"$f":"IF(AJ$2=1,Klimadaten!AJ56,\"\")","v":""},null,null,null,{"$f":"IF(AN$2=1,Klimadaten!AN56,\"\")","v":""},null,null,null,{"$f":"IF(AR$2=1,Klimadaten!AR56,\"\")","v":""},null,null,null,{"$f":"IF(AV$2=1,Klimadaten!AV56,\"\")","v":""},null,null,null,{"$f":"IF(AZ$2=1,Klimadaten!AZ56,\"\")","v":""},null,null,null,{"$f":"IF(BD$2=1,Klimadaten!BD56,\"\")","v":""},null,null,null,{"$f":"IF(BH$2=1,Klimadaten!BH56,\"\")","v":""},null,null,null,{"$f":"IF(BL$2=1,Klimadaten!BL56,\"\")","v":""},null,null,null,{"$f":"IF(BP$2=1,Klimadaten!BP56,\"\")","v":""},null,null,null,{"$f":"IF(BT$2=1,Klimadaten!BT56,\"\")","v":""},null,null,null,{"$f":"IF(BX$2=1,Klimadaten!BX56,\"\")","v":""},null,null,null,{"$f":"IF(CB$2=1,Klimadaten!CB56,\"\")","v":""},null,null,null,{"$f":"IF(CF$2=1,Klimadaten!CF56,\"\")","v":""},null,null,null,{"$f":"IF(CJ$2=1,Klimadaten!CJ56,\"\")","v":""},null,null,null,{"$f":"IF(CN$2=1,Klimadaten!CN56,\"\")","v":""},null,null,null,{"$f":"IF(CR$2=1,Klimadaten!CR56,\"\")","v":0},null,null,null,{"$f":"IF(CV$2=1,Klimadaten!CV56,\"\")","v":""},null,null,null,{"$f":"IF(CZ$2=1,Klimadaten!CZ56,\"\")","v":""},null,null,null,{"$f":"IF(DD$2=1,Klimadaten!DD56,\"\")","v":""},null,null,null,{"$f":"IF(DH$2=1,Klimadaten!DH56,\"\")","v":""},null,null,null,{"$f":"IF(DL$2=1,Klimadaten!DL56,\"\")","v":""},null,null,null,{"$f":"IF(DP$2=1,Klimadaten!DP56,\"\")","v":""},null,null,null,{"$f":"IF(DT$2=1,Klimadaten!DT56,\"\")","v":""},null,null,null,{"$f":"IF(DX$2=1,Klimadaten!DX56,\"\")","v":""},null,null,null,{"$f":"IF(EB$2=1,Klimadaten!EB56,\"\")","v":""},null,null,null,{"$f":"IF(EF$2=1,Klimadaten!EF56,\"\")","v":""},null,null,null,{"$f":"IF(EJ$2=1,Klimadaten!EJ56,\"\")","v":""},null,null,null,{"$f":"IF(EN$2=1,Klimadaten!EN56,\"\")","v":""},null,null,null,{"$f":"IF(ER$2=1,Klimadaten!ER56,\"\")","v":""},null,null,null,{"$f":"IF(EV$2=1,Klimadaten!EV56,\"\")","v":""},null,null,null,{"$f":"IF(EZ$2=1,Klimadaten!EZ56,\"\")","v":""},null,null,null,{"$f":"IF(FD$2=1,Klimadaten!FD56,\"\")","v":""},null,null,null,{"$f":"IF(FH$2=1,Klimadaten!FH56,\"\")","v":""},null,null,null,{"$f":"IF(FL$2=1,Klimadaten!FL56,\"\")","v":""},null,null,null,{"$f":"IF(FP$2=1,Klimadaten!FP56,\"\")","v":""},null,null,null,{"$f":"IF(FT$2=1,Klimadaten!FT56,\"\")","v":""},null,null,null,{"$f":"IF(FX$2=1,Klimadaten!FX56,\"\")","v":""},null,null,null,{"$f":"IF(GB$2=1,Klimadaten!GB56,\"\")","v":""},null,null,null,{"$f":"IF(GF$2=1,Klimadaten!GF56,\"\")","v":""},null,null,null,{"$f":"IF(GJ$2=1,Klimadaten!GJ56,\"\")","v":""},null,null,null,{"$f":"IF(GN$2=1,Klimadaten!GN56,\"\")","v":""},null,null,null,{"$f":"IF(GR$2=1,Klimadaten!GR56,\"\")","v":""},null,null,null,{"$f":"IF(GV$2=1,Klimadaten!GV56,\"\")","v":""},null,null,null,{"$f":"IF(GZ$2=1,Klimadaten!GZ56,\"\")","v":""},null,null,null,{"$f":"IF(HD$2=1,Klimadaten!HD56,\"\")","v":""},null,null,null,{"$f":"IF(HH$2=1,Klimadaten!HH56,\"\")","v":""},null,null,null,{"$f":"IF(HL$2=1,Klimadaten!HL56,\"\")","v":0},null,null,null,null,null,null,null,null,null,null,null,null,null,null,null,null,null,null,null,{"$f":"IF(IF$2=1,Klimadaten!IF56,\"\")","v":""},null,null,null,{"$f":"IF(IJ$2=1,Klimadaten!IJ56,\"\")","v":""},null,null,null,{"$f":"IF(IN$2=1,Klimadaten!IN56,\"\")","v":""},null,null,null,{"$f":"IF(IR$2=1,Klimadaten!IR56,\"\")","v":""},null,null,null,{"$f":"IF(IV$2=1,Klimadaten!IV56,\"\")","v":""}]
[27,null,null,{"$f":"IF(D$2=1,Klimadaten!D57,\"\")","v":""},null,null,null,{"$f":"IF(H$2=1,Klimadaten!H57,\"\")","v":0},null,null,null,{"$f":"IF(L$2=1,Klimadaten!L57,\"\")","v":1},null,null,null,{"$f":"IF(P$2=1,Klimadaten!P57,\"\")","v":""},null,null,null,{"$f":"IF(T$2=1,Klimadaten!T57,\"\")","v":""},null,null,null,{"$f":"IF(X$2=1,Klimadaten!X57,\"\")","v":""},null,null,null,{"$f":"IF(AB$2=1,Klimadaten!AB57,\"\")","v":""},null,null,null,{"$f":"IF(AF$2=1,Klimadaten!AF57,\"\")","v":""},null,null,null,{"$f":"IF(AJ$2=1,Klimadaten!AJ57,\"\")","v":""},null,null,null,{"$f":"IF(AN$2=1,Klimadaten!AN57,\"\")","v":""},null,null,null,{"$f":"IF(AR$2=1,Klimadaten!AR57,\"\")","v":""},null,null,null,{"$f":"IF(AV$2=1,Klimadaten!AV57,\"\")","v":""},null,null,null,{"$f":"IF(AZ$2=1,Klimadaten!AZ57,\"\")","v":""},null,null,null,{"$f":"IF(BD$2=1,Klimadaten!BD57,\"\")","v":""},null,null,null,{"$f":"IF(BH$2=1,Klimadaten!BH57,\"\")","v":""},null,null,null,{"$f":"IF(BL$2=1,Klimadaten!BL57,\"\")","v":""},null,null,null,{"$f":"IF(BP$2=1,Klimadaten!BP57,\"\")","v":""},null,null,null,{"$f":"IF(BT$2=1,Klimadaten!BT57,\"\")","v":""},null,null,null,{"$f":"IF(BX$2=1,Klimadaten!BX57,\"\")","v":""},null,null,null,{"$f":"IF(CB$2=1,Klimadaten!CB57,\"\")","v":""},null,null,null,{"$f":"IF(CF$2=1,Klimadaten!CF57,\"\")","v":""},null,null,null,{"$f":"IF(CJ$2=1,Klimadaten!CJ57,\"\")","v":""},null,null,null,{"$f":"IF(CN$2=1,Klimadaten!CN57,\"\")","v":""},null,null,null,{"$f":"IF(CR$2=1,Klimadaten!CR57,\"\")","v":0},null,null,null,{"$f":"IF(CV$2=1,Klimadaten!CV57,\"\")","v":""},null,null,null,{"$f":"IF(CZ$2=1,Klimadaten!CZ57,\"\")","v":""},null,null,null,{"$f":"IF(DD$2=1,Klimadaten!DD57,\"\")","v":""},null,null,null,{"$f":"IF(DH$2=1,Klimadaten!DH57,\"\")","v":""},null,null,null,{"$f":"IF(DL$2=1,Klimadaten!DL57,\"\")","v":""},null,null,null,{"$f":"IF(DP$2=1,Klimadaten!DP57,\"\")","v":""},null,null,null,{"$f":"IF(DT$2=1,Klimadaten!DT57,\"\")","v":""},null,null,null,{"$f":"IF(DX$2=1,Klimadaten!DX57,\"\")","v":""},null,null,null,{"$f":"IF(EB$2=1,Klimadaten!EB57,\"\")","v":""},null,null,null,{"$f":"IF(EF$2=1,Klimadaten!EF57,\"\")","v":""},null,null,null,{"$f":"IF(EJ$2=1,Klimadaten!EJ57,\"\")","v":""},null,null,null,{"$f":"IF(EN$2=1,Klimadaten!EN57,\"\")","v":""},null,null,null,{"$f":"IF(ER$2=1,Klimadaten!ER57,\"\")","v":""},null,null,null,{"$f":"IF(EV$2=1,Klimadaten!EV57,\"\")","v":""},null,null,null,{"$f":"IF(EZ$2=1,Klimadaten!EZ57,\"\")","v":""},null,null,null,{"$f":"IF(FD$2=1,Klimadaten!FD57,\"\")","v":""},null,null,null,{"$f":"IF(FH$2=1,Klimadaten!FH57,\"\")","v":""},null,null,null,{"$f":"IF(FL$2=1,Klimadaten!FL57,\"\")","v":""},null,null,null,{"$f":"IF(FP$2=1,Klimadaten!FP57,\"\")","v":""},null,null,null,{"$f":"IF(FT$2=1,Klimadaten!FT57,\"\")","v":""},null,null,null,{"$f":"IF(FX$2=1,Klimadaten!FX57,\"\")","v":""},null,null,null,{"$f":"IF(GB$2=1,Klimadaten!GB57,\"\")","v":""},null,null,null,{"$f":"IF(GF$2=1,Klimadaten!GF57,\"\")","v":""},null,null,null,{"$f":"IF(GJ$2=1,Klimadaten!GJ57,\"\")","v":""},null,null,null,{"$f":"IF(GN$2=1,Klimadaten!GN57,\"\")","v":""},null,null,null,{"$f":"IF(GR$2=1,Klimadaten!GR57,\"\")","v":""},null,null,null,{"$f":"IF(GV$2=1,Klimadaten!GV57,\"\")","v":""},null,null,null,{"$f":"IF(GZ$2=1,Klimadaten!GZ57,\"\")","v":""},null,null,null,{"$f":"IF(HD$2=1,Klimadaten!HD57,\"\")","v":""},null,null,null,{"$f":"IF(HH$2=1,Klimadaten!HH57,\"\")","v":""},null,null,null,{"$f":"IF(HL$2=1,Klimadaten!HL57,\"\")","v":0},null,null,null,null,null,null,null,null,null,null,null,null,null,null,null,null,null,null,null,{"$f":"IF(IF$2=1,Klimadaten!IF57,\"\")","v":""},null,null,null,{"$f":"IF(IJ$2=1,Klimadaten!IJ57,\"\")","v":""},null,null,null,{"$f":"IF(IN$2=1,Klimadaten!IN57,\"\")","v":""},null,null,null,{"$f":"IF(IR$2=1,Klimadaten!IR57,\"\")","v":""},null,null,null,{"$f":"IF(IV$2=1,Klimadaten!IV57,\"\")","v":""}]
[28,null,null,{"$f":"IF(D$2=1,Klimadaten!D58,\"\")","v":""},null,null,null,{"$f":"IF(H$2=1,Klimadaten!H58,\"\")","v":0},null,null,null,{"$f":"IF(L$2=1,Klimadaten!L58,\"\")","v":0},null,null,null,{"$f":"IF(P$2=1,Klimadaten!P58,\"\")","v":""},null,null,null,{"$f":"IF(T$2=1,Klimadaten!T58,\"\")","v":""},null,null,null,{"$f":"IF(X$2=1,Klimadaten!X58,\"\")","v":""},null,null,null,{"$f":"IF(AB$2=1,Klimadaten!AB58,\"\")","v":""},null,null,null,{"$f":"IF(AF$2=1,Klimadaten!AF58,\"\")","v":""},null,null,null,{"$f":"IF(AJ$2=1,Klimadaten!AJ58,\"\")","v":""},null,null,null,{"$f":"IF(AN$2=1,Klimadaten!AN58,\"\")","v":""},null,null,null,{"$f":"IF(AR$2=1,Klimadaten!AR58,\"\")","v":""},null,null,null,{"$f":"IF(AV$2=1,Klimadaten!AV58,\"\")","v":""},null,null,null,{"$f":"IF(AZ$2=1,Klimadaten!AZ58,\"\")","v":""},null,null,null,{"$f":"IF(BD$2=1,Klimadaten!BD58,\"\")","v":""},null,null,null,{"$f":"IF(BH$2=1,Klimadaten!BH58,\"\")","v":""},null,null,null,{"$f":"IF(BL$2=1,Klimadaten!BL58,\"\")","v":""},null,null,null,{"$f":"IF(BP$2=1,Klimadaten!BP58,\"\")","v":""},null,null,null,{"$f":"IF(BT$2=1,Klimadaten!BT58,\"\")","v":""},null,null,null,{"$f":"IF(BX$2=1,Klimadaten!BX58,\"\")","v":""},null,null,null,{"$f":"IF(CB$2=1,Klimadaten!CB58,\"\")","v":""},null,null,null,{"$f":"IF(CF$2=1,Klimadaten!CF58,\"\")","v":""},null,null,null,{"$f":"IF(CJ$2=1,Klimadaten!CJ58,\"\")","v":""},null,null,null,{"$f":"IF(CN$2=1,Klimadaten!CN58,\"\")","v":""},null,null,null,{"$f":"IF(CR$2=1,Klimadaten!CR58,\"\")","v":0},null,null,null,{"$f":"IF(CV$2=1,Klimadaten!CV58,\"\")","v":""},null,null,null,{"$f":"IF(CZ$2=1,Klimadaten!CZ58,\"\")","v":""},null,null,null,{"$f":"IF(DD$2=1,Klimadaten!DD58,\"\")","v":""},null,null,null,{"$f":"IF(DH$2=1,Klimadaten!DH58,\"\")","v":""},null,null,null,{"$f":"IF(DL$2=1,Klimadaten!DL58,\"\")","v":""},null,null,null,{"$f":"IF(DP$2=1,Klimadaten!DP58,\"\")","v":""},null,null,null,{"$f":"IF(DT$2=1,Klimadaten!DT58,\"\")","v":""},null,null,null,{"$f":"IF(DX$2=1,Klimadaten!DX58,\"\")","v":""},null,null,null,{"$f":"IF(EB$2=1,Klimadaten!EB58,\"\")","v":""},null,null,null,{"$f":"IF(EF$2=1,Klimadaten!EF58,\"\")","v":""},null,null,null,{"$f":"IF(EJ$2=1,Klimadaten!EJ58,\"\")","v":""},null,null,null,{"$f":"IF(EN$2=1,Klimadaten!EN58,\"\")","v":""},null,null,null,{"$f":"IF(ER$2=1,Klimadaten!ER58,\"\")","v":""},null,null,null,{"$f":"IF(EV$2=1,Klimadaten!EV58,\"\")","v":""},null,null,null,{"$f":"IF(EZ$2=1,Klimadaten!EZ58,\"\")","v":""},null,null,null,{"$f":"IF(FD$2=1,Klimadaten!FD58,\"\")","v":""},null,null,null,{"$f":"IF(FH$2=1,Klimadaten!FH58,\"\")","v":""},null,null,null,{"$f":"IF(FL$2=1,Klimadaten!FL58,\"\")","v":""},null,null,null,{"$f":"IF(FP$2=1,Klimadaten!FP58,\"\")","v":""},null,null,null,{"$f":"IF(FT$2=1,Klimadaten!FT58,\"\")","v":""},null,null,null,{"$f":"IF(FX$2=1,Klimadaten!FX58,\"\")","v":""},null,null,null,{"$f":"IF(GB$2=1,Klimadaten!GB58,\"\")","v":""},null,null,null,{"$f":"IF(GF$2=1,Klimadaten!GF58,\"\")","v":""},null,null,null,{"$f":"IF(GJ$2=1,Klimadaten!GJ58,\"\")","v":""},null,null,null,{"$f":"IF(GN$2=1,Klimadaten!GN58,\"\")","v":""},null,null,null,{"$f":"IF(GR$2=1,Klimadaten!GR58,\"\")","v":""},null,null,null,{"$f":"IF(GV$2=1,Klimadaten!GV58,\"\")","v":""},null,null,null,{"$f":"IF(GZ$2=1,Klimadaten!GZ58,\"\")","v":""},null,null,null,{"$f":"IF(HD$2=1,Klimadaten!HD58,\"\")","v":""},null,null,null,{"$f":"IF(HH$2=1,Klimadaten!HH58,\"\")","v":""},null,null,null,{"$f":"IF(HL$2=1,Klimadaten!HL58,\"\")","v":0},null,null,null,null,null,null,null,null,null,null,null,null,null,null,null,null,null,null,null,{"$f":"IF(IF$2=1,Klimadaten!IF58,\"\")","v":""},null,null,null,{"$f":"IF(IJ$2=1,Klimadaten!IJ58,\"\")","v":""},null,null,null,{"$f":"IF(IN$2=1,Klimadaten!IN58,\"\")","v":""},null,null,null,{"$f":"IF(IR$2=1,Klimadaten!IR58,\"\")","v":""},null,null,null,{"$f":"IF(IV$2=1,Klimadaten!IV58,\"\")","v":""}]
[29,null,null,{"$f":"IF(D$2=1,Klimadaten!D59,\"\")","v":""},null,null,null,{"$f":"IF(H$2=1,Klimadaten!H59,\"\")","v":0},null,null,null,{"$f":"IF(L$2=1,Klimadaten!L59,\"\")","v":0},null,null,null,{"$f":"IF(P$2=1,Klimadaten!P59,\"\")","v":""},null,null,null,{"$f":"IF(T$2=1,Klimadaten!T59,\"\")","v":""},null,null,null,{"$f":"IF(X$2=1,Klimadaten!X59,\"\")","v":""},null,null,null,{"$f":"IF(AB$2=1,Klimadaten!AB59,\"\")","v":""},null,null,null,{"$f":"IF(AF$2=1,Klimadaten!AF59,\"\")","v":""},null,null,null,{"$f":"IF(AJ$2=1,Klimadaten!AJ59,\"\")","v":""},null,null,null,{"$f":"IF(AN$2=1,Klimadaten!AN59,\"\")","v":""},null,null,null,{"$f":"IF(AR$2=1,Klimadaten!AR59,\"\")","v":""},null,null,null,{"$f":"IF(AV$2=1,Klimadaten!AV59,\"\")","v":""},null,null,null,{"$f":"IF(AZ$2=1,Klimadaten!AZ59,\"\")","v":""},null,null,null,{"$f":"IF(BD$2=1,Klimadaten!BD59,\"\")","v":""},null,null,null,{"$f":"IF(BH$2=1,Klimadaten!BH59,\"\")","v":""},null,null,null,{"$f":"IF(BL$2=1,Klimadaten!BL59,\"\")","v":""},null,null,null,{"$f":"IF(BP$2=1,Klimadaten!BP59,\"\")","v":""},null,null,null,{"$f":"IF(BT$2=1,Klimadaten!BT59,\"\")","v":""},null,null,null,{"$f":"IF(BX$2=1,Klimadaten!BX59,\"\")","v":""},null,null,null,{"$f":"IF(CB$2=1,Klimadaten!CB59,\"\")","v":""},null,null,null,{"$f":"IF(CF$2=1,Klimadaten!CF59,\"\")","v":""},null,null,null,{"$f":"IF(CJ$2=1,Klimadaten!CJ59,\"\")","v":""},null,null,null,{"$f":"IF(CN$2=1,Klimadaten!CN59,\"\")","v":""},null,null,null,{"$f":"IF(CR$2=1,Klimadaten!CR59,\"\")","v":0},null,null,null,{"$f":"IF(CV$2=1,Klimadaten!CV59,\"\")","v":""},null,null,null,{"$f":"IF(CZ$2=1,Klimadaten!CZ59,\"\")","v":""},null,null,null,{"$f":"IF(DD$2=1,Klimadaten!DD59,\"\")","v":""},null,null,null,{"$f":"IF(DH$2=1,Klimadaten!DH59,\"\")","v":""},null,null,null,{"$f":"IF(DL$2=1,Klimadaten!DL59,\"\")","v":""},null,null,null,{"$f":"IF(DP$2=1,Klimadaten!DP59,\"\")","v":""},null,null,null,{"$f":"IF(DT$2=1,Klimadaten!DT59,\"\")","v":""},null,null,null,{"$f":"IF(DX$2=1,Klimadaten!DX59,\"\")","v":""},null,null,null,{"$f":"IF(EB$2=1,Klimadaten!EB59,\"\")","v":""},null,null,null,{"$f":"IF(EF$2=1,Klimadaten!EF59,\"\")","v":""},null,null,null,{"$f":"IF(EJ$2=1,Klimadaten!EJ59,\"\")","v":""},null,null,null,{"$f":"IF(EN$2=1,Klimadaten!EN59,\"\")","v":""},null,null,null,{"$f":"IF(ER$2=1,Klimadaten!ER59,\"\")","v":""},null,null,null,{"$f":"IF(EV$2=1,Klimadaten!EV59,\"\")","v":""},null,null,null,{"$f":"IF(EZ$2=1,Klimadaten!EZ59,\"\")","v":""},null,null,null,{"$f":"IF(FD$2=1,Klimadaten!FD59,\"\")","v":""},null,null,null,{"$f":"IF(FH$2=1,Klimadaten!FH59,\"\")","v":""},null,null,null,{"$f":"IF(FL$2=1,Klimadaten!FL59,\"\")","v":""},null,null,null,{"$f":"IF(FP$2=1,Klimadaten!FP59,\"\")","v":""},null,null,null,{"$f":"IF(FT$2=1,Klimadaten!FT59,\"\")","v":""},null,null,null,{"$f":"IF(FX$2=1,Klimadaten!FX59,\"\")","v":""},null,null,null,{"$f":"IF(GB$2=1,Klimadaten!GB59,\"\")","v":""},null,null,null,{"$f":"IF(GF$2=1,Klimadaten!GF59,\"\")","v":""},null,null,null,{"$f":"IF(GJ$2=1,Klimadaten!GJ59,\"\")","v":""},null,null,null,{"$f":"IF(GN$2=1,Klimadaten!GN59,\"\")","v":""},null,null,null,{"$f":"IF(GR$2=1,Klimadaten!GR59,\"\")","v":""},null,null,null,{"$f":"IF(GV$2=1,Klimadaten!GV59,\"\")","v":""},null,null,null,{"$f":"IF(GZ$2=1,Klimadaten!GZ59,\"\")","v":""},null,null,null,{"$f":"IF(HD$2=1,Klimadaten!HD59,\"\")","v":""},null,null,null,{"$f":"IF(HH$2=1,Klimadaten!HH59,\"\")","v":""},null,null,null,{"$f":"IF(HL$2=1,Klimadaten!HL59,\"\")","v":0},null,null,null,null,null,null,null,null,null,null,null,null,null,null,null,null,null,null,null,{"$f":"IF(IF$2=1,Klimadaten!IF59,\"\")","v":""},null,null,null,{"$f":"IF(IJ$2=1,Klimadaten!IJ59,\"\")","v":""},null,null,null,{"$f":"IF(IN$2=1,Klimadaten!IN59,\"\")","v":""},null,null,null,{"$f":"IF(IR$2=1,Klimadaten!IR59,\"\")","v":""},null,null,null,{"$f":"IF(IV$2=1,Klimadaten!IV59,\"\")","v":""}]
[30,null,null,{"$f":"IF(D$2=1,Klimadaten!D60,\"\")","v":""},null,null,null,{"$f":"IF(H$2=1,Klimadaten!H60,\"\")","v":0},null,null,null,{"$f":"IF(L$2=1,Klimadaten!L60,\"\")","v":0},null,null,null,{"$f":"IF(P$2=1,Klimadaten!P60,\"\")","v":""},null,null,null,{"$f":"IF(T$2=1,Klimadaten!T60,\"\")","v":""},null,null,null,{"$f":"IF(X$2=1,Klimadaten!X60,\"\")","v":""},null,null,null,{"$f":"IF(AB$2=1,Klimadaten!AB60,\"\")","v":""},null,null,null,{"$f":"IF(AF$2=1,Klimadaten!AF60,\"\")","v":""},null,null,null,{"$f":"IF(AJ$2=1,Klimadaten!AJ60,\"\")","v":""},null,null,null,{"$f":"IF(AN$2=1,Klimadaten!AN60,\"\")","v":""},null,null,null,{"$f":"IF(AR$2=1,Klimadaten!AR60,\"\")","v":""},null,null,null,{"$f":"IF(AV$2=1,Klimadaten!AV60,\"\")","v":""},null,null,null,{"$f":"IF(AZ$2=1,Klimadaten!AZ60,\"\")","v":""},null,null,null,{"$f":"IF(BD$2=1,Klimadaten!BD60,\"\")","v":""},null,null,null,{"$f":"IF(BH$2=1,Klimadaten!BH60,\"\")","v":""},null,null,null,{"$f":"IF(BL$2=1,Klimadaten!BL60,\"\")","v":""},null,null,null,{"$f":"IF(BP$2=1,Klimadaten!BP60,\"\")","v":""},null,null,null,{"$f":"IF(BT$2=1,Klimadaten!BT60,\"\")","v":""},null,null,null,{"$f":"IF(BX$2=1,Klimadaten!BX60,\"\")","v":""},null,null,null,{"$f":"IF(CB$2=1,Klimadaten!CB60,\"\")","v":""},null,null,null,{"$f":"IF(CF$2=1,Klimadaten!CF60,\"\")","v":""},null,null,null,{"$f":"IF(CJ$2=1,Klimadaten!CJ60,\"\")","v":""},null,null,null,{"$f":"IF(CN$2=1,Klimadaten!CN60,\"\")","v":""},null,null,null,{"$f":"IF(CR$2=1,Klimadaten!CR60,\"\")","v":0},null,null,null,{"$f":"IF(CV$2=1,Klimadaten!CV60,\"\")","v":""},null,null,null,{"$f":"IF(CZ$2=1,Klimadaten!CZ60,\"\")","v":""},null,null,null,{"$f":"IF(DD$2=1,Klimadaten!DD60,\"\")","v":""},null,null,null,{"$f":"IF(DH$2=1,Klimadaten!DH60,\"\")","v":""},null,null,null,{"$f":"IF(DL$2=1,Klimadaten!DL60,\"\")","v":""},null,null,null,{"$f":"IF(DP$2=1,Klimadaten!DP60,\"\")","v":""},null,null,null,{"$f":"IF(DT$2=1,Klimadaten!DT60,\"\")","v":""},null,null,null,{"$f":"IF(DX$2=1,Klimadaten!DX60,\"\")","v":""},null,null,null,{"$f":"IF(EB$2=1,Klimadaten!EB60,\"\")","v":""},null,null,null,{"$f":"IF(EF$2=1,Klimadaten!EF60,\"\")","v":""},null,null,null,{"$f":"IF(EJ$2=1,Klimadaten!EJ60,\"\")","v":""},null,null,null,{"$f":"IF(EN$2=1,Klimadaten!EN60,\"\")","v":""},null,null,null,{"$f":"IF(ER$2=1,Klimadaten!ER60,\"\")","v":""},null,null,null,{"$f":"IF(EV$2=1,Klimadaten!EV60,\"\")","v":""},null,null,null,{"$f":"IF(EZ$2=1,Klimadaten!EZ60,\"\")","v":""},null,null,null,{"$f":"IF(FD$2=1,Klimadaten!FD60,\"\")","v":""},null,null,null,{"$f":"IF(FH$2=1,Klimadaten!FH60,\"\")","v":""},null,null,null,{"$f":"IF(FL$2=1,Klimadaten!FL60,\"\")","v":""},null,null,null,{"$f":"IF(FP$2=1,Klimadaten!FP60,\"\")","v":""},null,null,null,{"$f":"IF(FT$2=1,Klimadaten!FT60,\"\")","v":""},null,null,null,{"$f":"IF(FX$2=1,Klimadaten!FX60,\"\")","v":""},null,null,null,{"$f":"IF(GB$2=1,Klimadaten!GB60,\"\")","v":""},null,null,null,{"$f":"IF(GF$2=1,Klimadaten!GF60,\"\")","v":""},null,null,null,{"$f":"IF(GJ$2=1,Klimadaten!GJ60,\"\")","v":""},null,null,null,{"$f":"IF(GN$2=1,Klimadaten!GN60,\"\")","v":""},null,null,null,{"$f":"IF(GR$2=1,Klimadaten!GR60,\"\")","v":""},null,null,null,{"$f":"IF(GV$2=1,Klimadaten!GV60,\"\")","v":""},null,null,null,{"$f":"IF(GZ$2=1,Klimadaten!GZ60,\"\")","v":""},null,null,null,{"$f":"IF(HD$2=1,Klimadaten!HD60,\"\")","v":""},null,null,null,{"$f":"IF(HH$2=1,Klimadaten!HH60,\"\")","v":""},null,null,null,{"$f":"IF(HL$2=1,Klimadaten!HL60,\"\")","v":0},null,null,null,null,null,null,null,null,null,null,null,null,null,null,null,null,null,null,null,{"$f":"IF(IF$2=1,Klimadaten!IF60,\"\")","v":""},null,null,null,{"$f":"IF(IJ$2=1,Klimadaten!IJ60,\"\")","v":""},null,null,null,{"$f":"IF(IN$2=1,Klimadaten!IN60,\"\")","v":""},null,null,null,{"$f":"IF(IR$2=1,Klimadaten!IR60,\"\")","v":""},null,null,null,{"$f":"IF(IV$2=1,Klimadaten!IV60,\"\")","v":""}]

{"sheet":"Q-Plan Tabelle_QM Tableau","index":10,"n_rows":57,"n_cols":7,"rows_kept":57,"cut":false,"hidden":false,"merged":[[54,0,54,4],[8,1,8,4]]}
[]
[{"$f":"Text!C120","v":"    Währungseinheit:                                      Brennstoff:"},null,null,null,null,null,{"$f":"Text!C172","v":"Vordefinition von Währung und Brennstofftyp"}]
[{"$f":"Verbraucher_Consommateurs!A3","v":"Projekt/Variante:"},{"$f":"IF(Verbraucher_Consommateurs!B3=\"\",\"\",Verbraucher_Consommateurs!B3)","v":"Musterbeispiel (Linie 1)"}]
[null,{"$f":"IF(Verbraucher_Consommateurs!B4=\"\",\"\",Verbraucher_Consommateurs!B4)","v":"Musterbeispiel (Linie 2)"}]
[null,{"$f":"IF(Verbraucher_Consommateurs!B5=\"\",\"\",Verbraucher_Consommateurs!B5)","v":"Musterbeispiel (Linie 3)"}]
[{"$f":"Verbraucher_Consommateurs!A6","v":"Erfasst von:"},{"$f":"IF(Verbraucher_Consommateurs!B6=\"\",\"\",Verbraucher_Consommateurs!B6)","v":"Musterplaner"}]
[{"$f":"Verbraucher_Consommateurs!A7","v":"Datum:"},{"$f":"IF(Verbraucher_Consommateurs!B7=\"\",\"\",Verbraucher_Consommateurs!B7)","v":"2014-05-02"}]
[{"$f":"Text!C121","v":"Excel-Tabelle «Q-Plan»"},null,null,null,null,null,{"$f":"Text!C173","v":"Berechnungs-Basis oder Beispiel für Eingabewert in Spalte \"Planung\":"}]
[{"$f":"Text!C122","v":"Projekt-Kurzbezeichnung oder Projekt-Nr."},{"$f":"Verbraucher_Consommateurs!B3","v":"Musterbeispiel (Linie 1)"},null,null,null,null,{"$f":"Text!C174","v":"Übernahme aus 'Verbraucher_Consommateurs' Zelle B3"}]
[null,null,null,{"$f":"Text!C123","v":"Planung"},{"$f":"Text!C124","v":"Ist, MS 5"}]
[]
[{"$f":"Text!C125","v":"Wärmebedarf aller Wärmeabnehmer"},null,"MWh/a",{"$f":"Hilfsblatt!I4+Hilfsblatt!I5+Hilfsblatt!I6","v":3933},null,null,{"$f":"Text!C175","v":"Planungswert von 'Hilfsblatt'"}]
[{"$f":"Text!C126","v":"          davon über das Wärmenetz"},null,"MWh/a",{"$f":"D12","v":3933},null,null,{"$f":"Text!C176","v":"Eingabewert; Formeleingabe möglich"}]
[{"$f":"Text!C127","v":"Wärmeverluste  Wärmenetz"},null,"MWh/a",{"$f":"Hilfsblatt!I7","v":393.3},null,null,{"$f":"Text!C177","v":"Planungswert von 'Hilfsblatt'"}]
[{"$f":"Text!C128","v":"Gesamtwärmebedarf  (inkl. Verluste Wärmenetz)"},null,"MWh/a",{"$f":"D12+D14","v":4326.3},{"$f":"E12+E14","v":0},null,{"$f":"TEXT(Text!C178,0)&\" \"&\"D12+D14\"","v":"Berechneter Wert: D12+D14"}]
[]
[{"$f":"Text!C129","v":"Wärmeleistungsbedarf  aller Wärmeabnehmer"},null,"kW",{"$f":"Anlage_Installation!C34","v":1562.5},null,null,{"$f":"Text!C179","v":"Planungswert von 'Anlage_Installation'"}]
[{"$f":"Text!C130","v":"          davon über das Wärmenetz"},null,"kW",{"$f":"D17","v":1562.5},null,null,{"$f":"Text!C180","v":"Frei einzugebender Wert; Formeleingabe möglich"}]
[{"$f":"Text!C131","v":"Wärmeleistungsverluste Wärmenetz"},null,"kW",{"$f":"Anlage_Installation!C22","v":44.9},null,null,{"$f":"Text!C181","v":"Planungswert von 'Anlage_Installation'"}]
[{"$f":"Text!C132","v":"Gesamt-Wärmeleistungsbedarf Wärmeerzeugung"},null,"kW",{"$f":"D17+D19","v":1607.4},{"$f":"E17+E19","v":0},null,{"$f":"TEXT(Text!C178,0)&\" \"&\"D17+D19\"","v":"Berechneter Wert: D17+D19"}]
[]
[{"$f":"Text!C133","v":"Trassenlänge Wärmenetz  (inkl. Hausanschlüsse)"},null,{"$f":"Text!C168","v":"Trm"},null,null,null,{"$f":"Text!C182","v":"Eingabewert; Formeleingabe möglich"}]
[]
[{"$f":"Text!C134","v":"Nennleistung der/des  Holzkessel(s) mit Referenzbrennstoff"},null,"kW",{"$f":"Wärmezentrale_CentraleThermique!D15","v":900},null,null,{"$f":"Text!C183","v":"Planungswert von 'Wärmezentrale_Chauffage'"}]
[{"$f":"Text!C135","v":"Nennleistung der Wärmeerzeugung mit anderen Energieträgern:  .......................................                                                                                    "},null,"kW",{"$f":"Wärmezentrale_CentraleThermique!D16","v":1500},null,null,{"$f":"Text!C184","v":"Planungswert von 'Wärmezentrale_Chauffage'"}]
[{"$f":"Text!C136","v":"Nennleistung der Wärmeerzeugung total"},null,"kW",{"$f":"D25+D24","v":2400},{"$f":"E25+E24","v":0},null,{"$f":"TEXT(Text!C178,0)&\" \"&\"D24+D25\"","v":"Berechneter Wert: D24+D25"}]
[]
[{"$f":"Text!C137","v":"Anteil der mit Holzenergie produzierte Wärmemenge"},null,"%",{"$f":"Hilfsblatt!L15","v":94.829706665270493},null,null,{"$f":"Text!C185","v":"Planungswert von 'Hilfsblatt'"}]
[{"$f":"Text!C138","v":"Mit Holzenergie produzierte Wärmemenge"},null,"MWh/a",{"$f":"D28*D15/100","v":4102.6175994595969},{"$f":"E28*E15/100","v":0},null,{"$f":"TEXT(Text!C178,0)&\" \"&\"D28*D15/100\"","v":"Berechneter Wert: D28*D15/100"}]
[{"$f":"Text!C139","v":"Silogrösse netto"},null,"m3",{"$f":"D32*D31/100","v":0},{"$f":"E32*E31/100","v":0},null,{"$f":"TEXT(Text!C178,0)&\" \"&\"D32*D31/100\"","v":"Berechneter Wert: D32*D31/100"}]
[{"$f":"Text!C140","v":"Füllgrad Silo"},null,"%",null,null,null,{"$f":"Text!C186","v":"Eingabewert; Formeleingabe möglich"}]
[{"$f":"Text!C141","v":"Silogrösse brutto"},null,"m3",null,null,null,{"$f":"Text!C187","v":"Eingabewert; Formeleingabe möglich"}]
[{"$f":"IF(Hilfsblatt!V2=1,Text!C142,Text!C143)","v":"Energie-Inhalt pro Schüttraummeter (Holzhackschnitzel)"},null,{"$f":"IF(Hilfsblatt!V2=1,Text!C166,\"kWh/kg\")","v":"kWh/Srm"},null,null,null,{"$f":"Text!C188","v":"Eingabewert; Formeleingabe möglich"}]
[{"$f":"Text!C144","v":"Jährlicher Brennstoffverbrauch der/des Holzkessel(s) "},null,{"$f":"IF(Hilfsblatt!V2=1,Text!C167,\"kg\")","v":"Srm"},{"$f":"D29*1000/(D33*0.85)","v":{"$error":"#DIV/0!"}},{"$f":"E29*1000/(E33*0.85)","v":{"$error":"#DIV/0!"}},null,{"$f":"TEXT(Text!C178,0)&\" \"&\"D29*1000/(D33*0.85)\"&TEXT(Text!C193,0)","v":"Berechneter Wert: D29*1000/(D33*0.85); Jahrenutzungsgrad Holzkessel 85%"}]
[]
[{"$f":"Text!C145","v":"Kosten"}]
[{"$f":"Text!C146","v":"Investitionskosten  Wärmeerzeugung "},null,{"$f":"IF(Hilfsblatt!U2=1,\"CHF\",\"€\")","v":"CHF"},null,null,null,{"$f":"Text!C189","v":"Eingabewert; Formeleingabe möglich"}]
[{"$f":"Text!C147","v":"Investitionskosten  Wärmenetz "},null,{"$f":"IF(Hilfsblatt!U2=1,\"CHF\",\"€\")","v":"CHF"},null,null,null,{"$f":"Text!C190","v":"Eingabewert; Formeleingabe möglich"}]
[]
[{"$f":"Text!C148","v":"Temperaturangaben im Auslegungspunkt"}]
[{"$f":"Text!C149","v":"Temperatur Hauptvorlauf Fernleitung"},null,"0C",null,null,null,{"$f":"Text!C191","v":"Eingabewert; Formeleingabe möglich"}]
[{"$f":"Text!C150","v":"Temperatur Hauptrücklauf Fernleitung "},null,"0C",null,null,null,{"$f":"Text!C192","v":"Eingabewert; Formeleingabe möglich"}]
[]
[{"$f":"Text!C151","v":"Kennzahlen"},{"$f":"Text!C152","v":"Vereinbarung"}]
[null,{"$f":"Text!C153","v":"bzw. Zielwert"}]
[{"$f":"Text!C154","v":"E.2.6 Vollbetriebsstundenzahl der Wärmeabnehmer"},null,"h/a",{"$f":"1000*D12/D17","v":2517.12},{"$f":"1000*E12/E17","v":{"$error":"#DIV/0!"}},null,{"$f":"TEXT(Text!C178,0)&\" \"&\"1000*D12/D17\"","v":"Berechneter Wert: 1000*D12/D17"}]
[{"$f":"Text!C155","v":"E.3.3 Anschlussdichte Wärmenetz"},"> 2.0",{"$f":"Text!C169","v":"MWh/(a Trm)"},{"$f":"D13/D22","v":{"$error":"#DIV/0!"}},{"$f":"E13/E22","v":{"$error":"#DIV/0!"}},null,{"$f":"TEXT(Text!C178,0)&\" \"&\"D13/D22\"","v":"Berechneter Wert: D13/D22"}]
[{"$f":"Text!C156","v":"E.3.3 Wärmeverluste Wärmenetz (% der zugeführten Wärme) "},"< 10","%",{"$f":"D14*100/(D13+D14)","v":9.0909090909090899},{"$f":"(E14*100)/(E13+E14)","v":{"$error":"#DIV/0!"}},null,{"$f":"TEXT(Text!C178,0)&\" \"&\"D14*100/(D13+D14)\"","v":"Berechneter Wert: D14*100/(D13+D14)"}]
[{"$f":"Text!C157","v":"Wärmeverteilkosten pro Trm "},null,{"$f":"IF(Hilfsblatt!U2=1,Text!C170,Text!C171)","v":"CHF/Trm"},{"$f":"D38/D22","v":{"$error":"#DIV/0!"}},{"$f":"E38/E22","v":{"$error":"#DIV/0!"}},null,{"$f":"TEXT(Text!C178,0)&\" \"&\"D38/D22\"","v":"Berechneter Wert: D38/D22"}]
[{"$f":"Text!C158","v":"E.3.3 Spezifische Investitionskosten Wärmenetz"},null,{"$f":"IF(Hilfsblatt!U2=1,\"CHF/(MWh/a)\",\"€/(MWh/a)\")","v":"CHF/(MWh/a)"},{"$f":"D38/D13","v":0},{"$f":"E38/E13","v":{"$error":"#DIV/0!"}},null,{"$f":"TEXT(Text!C178,0)&\" \"&\"D38/D13\"","v":"Berechneter Wert: D38/D13"}]
[{"$f":"Text!C159","v":"E.4.10 Spezifische Investitionskosten Wärmeerzeugung"},null,{"$f":"IF(Hilfsblatt!U2=1,\"CHF/kW\",\"€/kW\")","v":"CHF/kW"},{"$f":"D37/D20","v":0},{"$f":"E37/E20","v":{"$error":"#DIV/0!"}},null,{"$f":"TEXT(Text!C178,0)&\" \"&\"D37/D20\"","v":"Berechneter Wert: D37/D20"}]
[{"$f":"Text!C160","v":"E.4.4 Vollbetriebsstundenzahl der/des Holzkessel(s) "},{"$f":"Wärmezentrale_CentraleThermique!E27","v":3500},"h/a",{"$f":"1000*D29/D24","v":4558.4639993995524},{"$f":"1000*E29/E24","v":{"$error":"#DIV/0!"}},null,{"$f":"TEXT(Text!C178,0)&\" \"&\"1000*D29/D24\"","v":"Berechneter Wert: 1000*D29/D24"}]
[{"$f":"Text!C161","v":"E.4.6 Vollbetriebsstundenzahl andere Wärmeerzeuger"},null,"h/a",{"$f":"1000*(D15-D29)/D25","v":149.12160036026884},{"$f":"1000*(E15-E29)/E25","v":{"$error":"#DIV/0!"}},null,{"$f":"TEXT(Text!C178,0)&\" \"&\"1000*(D15-D29)/D25\"","v":"Berechneter Wert: 1000*(D15-D29)/D25"}]
[{"$f":"IF(Hilfsblatt!V2=1,Text!C162,Text!C163)","v":"E.4.5 Silogrösse: Abdeckung des Vollastbedarfs für Anzahl Tage (+30Srm)"},{"$f":"IF(Hilfsblatt!V2=1,\"5-7\",\"–\")","v":"5-7"},{"$f":"Text!C165","v":"Tage"},{"$f":"IF(Hilfsblatt!V2=1,(D30-30)*D33*0.85/(D24*24),D30*(D33*650)*0.85/(D24*24))","v":0},{"$f":"((E30-30)*E33*0.85)/(E24*24)","v":{"$error":"#DIV/0!"}},null,{"$f":"TEXT(Text!C178,0)&\" \"&IF(Hilfsblatt!V2=1,\"(D30-30)*D33*0.85/(D24*24)\",\"D30*(D33*650)*0.85/(D24*24)\")&TEXT(Text!C193,0)","v":"Berechneter Wert: (D30-30)*D33*0.85/(D24*24); Jahrenutzungsgrad Holzkessel 85%"}]
[{"$f":"Text!C164","v":"Die grau hinterlegten Felder sind Eingabefelder"}]
[null,null,null,null,{"$f":"Verbraucher_Consommateurs!B42","v":"Situationserfassung V35"},null,{"$f":"Text!C45","v":"Eingabefelder"}]
[null,null,null,null,null,null,{"$f":"Text!C30","v":"Empfohlene Dateiformate: .xlsm oder .xls (Excel 97-2004)"}]

{"sheet":"AT-Vergleich_Comparaison TE","index":11,"n_rows":46,"n_cols":18,"rows_kept":46,"cut":false,"hidden":false,"merged":[[37,0,37,6],[45,0,45,6]]}
[null,null,null,null,null,null,null,null,null,null,null,"Schweiz (CH)",null,null,null,null,null,"Österreich (AT)"]
[null,null,null,null,null,null,null,null,"Off",null,"On","Andermatt",null,null,"Off",null,"On","Bad Aussee"]
[null,null,null,null,null,null,null,null,"Off",null,"On","Acquarossa/Comprovasco",null,null,"Off",null,"On","Bregenz"]
[null,null,null,null,null,null,null,null,"Off",null,"On","Bad Ragaz",null,null,"Off",null,"On","Eisenstadt"]
[null,null,null,null,null,null,null,null,"Off",null,"On","Basel-Binningen",null,null,"Off",null,"On","Freistadt"]
[null,null,null,null,null,null,null,null,"Off",null,"On","Bern/Zollikofen",null,null,"Off",null,"On","Fürstenfeld"]
[null,null,null,null,null,null,null,null,"Off",null,"On","Bullet / La Fretaz",null,null,"Off",null,"On","Graz Universität"]
[null,null,null,null,null,null,null,null,"Off",null,"On","Château-d'Oex",null,null,"Off",null,"On","Hohenau/March"]
[null,null,null,null,null,null,null,null,"Off",null,"On","Davos",null,null,"Off",null,"On","Innsbruck Universität"]
[null,null,null,null,null,null,null,null,"Off",null,"On","Disentis/Sedrun",null,null,"Off",null,"On","Klagenfurt Flughafen"]
[null,null,null,null,null,null,null,null,"Off",null,"On","Einsiedeln",null,null,"Off",null,"On","Kufstein"]
[null,null,null,null,null,null,null,null,"Off",null,"On","Engelberg",null,null,"Off",null,"On","Lienz"]
[null,null,null,null,null,null,null,null,"Off",null,"On","Fribourg/Posieux",null,null,"Off",null,"On","Linz Stadt"]
[null,null,null,null,null,null,null,null,"Off",null,"On","La Chaux-de-Fonds",null,null,"Off",null,"On","Mariazell"]
[null,null,null,null,null,null,null,null,"Off",null,"On","Langnau i.E.",null,null,"Off",null,"On","Salzburg-Freisaal"]
[null,null,null,null,null,null,null,null,"Off",null,"On","Locarno/Monti",null,null,"Off",null,"On","Schröcken"]
[null,null,null,null,null,null,null,null,"Off",null,"On","Luzern",null,null,"Off",null,"On","St. Pölten"]
[null,null,null,null,null,null,null,null,"Off",null,"On","Payerne",null,null,"Off",null,"On","Tamsweg"]
[null,null,null,null,null,null,null,null,"Off",null,"On","Piotta",null,null,"Off",null,"On","Wien innere Stadt"]
[null,null,null,null,null,null,null,null,"Off",null,"On","Pully",null,null,"Off",null,"On","Zell am See"]
[null,null,null,null,null,null,null,null,"Off",null,"On","Rünenberg",null,null,"Off",null,"On","Zeltweg"]
[null,null,null,null,null,null,null,null,"Off",null,"On","Samedan"]
[null,null,null,null,null,null,null,null,"Off",null,"On","St. Gallen"]
[null,null,null,null,null,null,null,null,"Off",null,"On","Ulrichen",null,null,null,null,null,"Slowenien (SI)"]
[null,null,null,null,null,null,null,null,"Off",null,"On","Visp",null,null,"Off",null,"On","BILJE *"]
[null,null,null,null,null,null,null,null,"Off",null,"On","Zürich/Fluntern",null,null,"Off",null,"On","BRNIK LETALIŠČE *"]
[null,null,null,null,null,null,null,null,null,null,null,null,null,null,"Off",null,"On","NOVA VAS, BLOKE *"]
[null,null,null,null,null,null,null,null,null,null,null,null,null,null,null,null,null,"* 1993 - 2002"]
[null,null,null,null,null,null,null,null,null,null,null,"Deutschland (DE)"]
[null,null,null,null,null,null,null,null,"Off",null,"On","Augsburg"]
[null,null,null,null,null,null,null,null,"Off",null,"On","Bamberg"]
[null,null,null,null,null,null,null,null,"Off",null,"On","Frankfurt/Main Flughafen"]
[null,null,null,null,null,null,null,null,"Off",null,"On","Hof"]
[null,null,null,null,null,null,null,null,"Off",null,"On","Hohenpeißenberg"]
[null,null,null,null,null,null,null,null,"Off",null,"On","Kahler Asten"]
[null,null,null,null,null,null,null,null,"Off",null,"On","Karlsruhe/Rheinstetten"]
[null,null,null,null,null,null,null,null,"Off",null,"On","Kempten"]
[null,null,null,null,null,null,null,null,"Off",null,"On","München Flughafen"]
[null,null,null,null,null,null,null,null,"Off",null,"On","Nürnberg"]
[null,null,null,null,null,null,null,null,"Off",null,"On","Trier-Petrisberg"]
[null,null,null,null,null,null,null,null,"Off",null,"On","Würzburg"]
[]
[]
[]
[null,null,null,null,null,null,null,null,null,{"$f":"Verbraucher_Consommateurs!B42","v":"Situationserfassung V35"}]
["Quellen: Meteo Schweiz und deutscher Wetterdienst. Die österreichischen Klimadaten wurden von der ZAMG bereitgestellt und dürfen nur im Rahmen dieses Excel-Werkzeugs verwendet werden!"]

{"sheet":"Aenderungsprotokoll","index":12,"n_rows":7,"n_cols":4,"rows_kept":7,"cut":false,"hidden":true,"merged":[]}
["Datum","Version","Aenderung","Wer"]
["2016-10-21","V34","Neue Versionsnummer vergeben; Von V33 auf V34;","ST"]
[null,"V34","Q-Plan Tabelle als Mappe ergänzt","ST"]
["2016-10-25","V34","an Q-Plan Tabelle weitergearbeitet","ST"]
[null,null,"Deutsche und Französiche Version in einer Mappe","ST"]
["2018-08-13","V35","Berechnung Silovolumen und Bewertung mit Pellets in der Mappe Q-Plan korrigiert (Zelle D54): Schüttdichte von Pellets ergänzt","ST"]
["2018-08-13","V35","Zielwert Silogrösse bei Hackschnitzel in der Mappe Q-Plan korrigiert (Zelle B54): Abdeckung von 6-7 Tage auf 5-7 tage korrigiert","ST"]